main.js · part 16
Full reference398 text occurrences from desktop/Cursor.app/Contents/Resources/app/extensions/cursor-agent-worker/dist/main.js, part 16. Every entry preserves the shipped literal and its saved verdict or selection reason.
File contents and all parts · All files
Shipped text
payload
Source: desktop/Cursor.app/Contents/Resources/app/extensions/cursor-agent-worker/dist/main.js, bytes 270820–270829, SHA-256 4039511016be9fd4.
Not classified: non-prose-or-short.
Readable text: payload
payload
prepare stderr
Source: desktop/Cursor.app/Contents/Resources/app/extensions/cursor-agent-worker/dist/main.js, bytes 270843–270859, SHA-256 b0ed21d42770359c.
Not classified: non-prose-or-short.
Readable text: prepare_stderr
prepare_stderr
scalar
Source: desktop/Cursor.app/Contents/Resources/app/extensions/cursor-agent-worker/dist/main.js, bytes 270865–270873, SHA-256 1cf2462dbf783967.
Not classified: non-prose-or-short.
Readable text: scalar
scalar
payload · byte 270884
Source: desktop/Cursor.app/Contents/Resources/app/extensions/cursor-agent-worker/dist/main.js, bytes 270884–270893, SHA-256 4039511016be9fd4.
Not classified: non-prose-or-short.
Readable text: payload
payload
prepare exit code
Source: desktop/Cursor.app/Contents/Resources/app/extensions/cursor-agent-worker/dist/main.js, bytes 270907–270926, SHA-256 3fdaa6e2e26bb439.
Not classified: non-prose-or-short.
Readable text: prepare_exit_code
prepare_exit_code
scalar · byte 270932
Source: desktop/Cursor.app/Contents/Resources/app/extensions/cursor-agent-worker/dist/main.js, bytes 270932–270940, SHA-256 1cf2462dbf783967.
Not classified: non-prose-or-short.
Readable text: scalar
scalar
payload · byte 270951
Source: desktop/Cursor.app/Contents/Resources/app/extensions/cursor-agent-worker/dist/main.js, bytes 270951–270960, SHA-256 4039511016be9fd4.
Not classified: non-prose-or-short.
Readable text: payload
payload
install command
Source: desktop/Cursor.app/Contents/Resources/app/extensions/cursor-agent-worker/dist/main.js, bytes 270974–270991, SHA-256 86b53f0d2d6c6987.
Not classified: non-prose-or-short.
Readable text: install_command
install_command
message
Source: desktop/Cursor.app/Contents/Resources/app/extensions/cursor-agent-worker/dist/main.js, bytes 270997–271006, SHA-256 fd3830a0864dd9df.
Not classified: non-prose-or-short.
Readable text: message
message
payload · byte 271018
Source: desktop/Cursor.app/Contents/Resources/app/extensions/cursor-agent-worker/dist/main.js, bytes 271018–271027, SHA-256 4039511016be9fd4.
Not classified: non-prose-or-short.
Readable text: payload
payload
install stdout
Source: desktop/Cursor.app/Contents/Resources/app/extensions/cursor-agent-worker/dist/main.js, bytes 271041–271057, SHA-256 172b1b5af02c29f5.
Not classified: non-prose-or-short.
Readable text: install_stdout
install_stdout
scalar · byte 271063
Source: desktop/Cursor.app/Contents/Resources/app/extensions/cursor-agent-worker/dist/main.js, bytes 271063–271071, SHA-256 1cf2462dbf783967.
Not classified: non-prose-or-short.
Readable text: scalar
scalar
payload · byte 271082
Source: desktop/Cursor.app/Contents/Resources/app/extensions/cursor-agent-worker/dist/main.js, bytes 271082–271091, SHA-256 4039511016be9fd4.
Not classified: non-prose-or-short.
Readable text: payload
payload
install stderr
Source: desktop/Cursor.app/Contents/Resources/app/extensions/cursor-agent-worker/dist/main.js, bytes 271105–271121, SHA-256 71611ba1ee0bcbcf.
Not classified: non-prose-or-short.
Readable text: install_stderr
install_stderr
scalar · byte 271127
Source: desktop/Cursor.app/Contents/Resources/app/extensions/cursor-agent-worker/dist/main.js, bytes 271127–271135, SHA-256 1cf2462dbf783967.
Not classified: non-prose-or-short.
Readable text: scalar
scalar
payload · byte 271146
Source: desktop/Cursor.app/Contents/Resources/app/extensions/cursor-agent-worker/dist/main.js, bytes 271146–271155, SHA-256 4039511016be9fd4.
Not classified: non-prose-or-short.
Readable text: payload
payload
install exit code
Source: desktop/Cursor.app/Contents/Resources/app/extensions/cursor-agent-worker/dist/main.js, bytes 271169–271188, SHA-256 6db0c2cd7d1b8ff1.
Not classified: non-prose-or-short.
Readable text: install_exit_code
install_exit_code
scalar · byte 271194
Source: desktop/Cursor.app/Contents/Resources/app/extensions/cursor-agent-worker/dist/main.js, bytes 271194–271202, SHA-256 1cf2462dbf783967.
Not classified: non-prose-or-short.
Readable text: scalar
scalar
payload · byte 271213
Source: desktop/Cursor.app/Contents/Resources/app/extensions/cursor-agent-worker/dist/main.js, bytes 271213–271222, SHA-256 4039511016be9fd4.
Not classified: non-prose-or-short.
Readable text: payload
payload
verify stdout
Source: desktop/Cursor.app/Contents/Resources/app/extensions/cursor-agent-worker/dist/main.js, bytes 271236–271251, SHA-256 e39d05268b21f841.
Not classified: non-prose-or-short.
Readable text: verify_stdout
verify_stdout
scalar · byte 271257
Source: desktop/Cursor.app/Contents/Resources/app/extensions/cursor-agent-worker/dist/main.js, bytes 271257–271265, SHA-256 1cf2462dbf783967.
Not classified: non-prose-or-short.
Readable text: scalar
scalar
payload · byte 271276
Source: desktop/Cursor.app/Contents/Resources/app/extensions/cursor-agent-worker/dist/main.js, bytes 271276–271285, SHA-256 4039511016be9fd4.
Not classified: non-prose-or-short.
Readable text: payload
payload
verify stderr
Source: desktop/Cursor.app/Contents/Resources/app/extensions/cursor-agent-worker/dist/main.js, bytes 271299–271314, SHA-256 e5bf9ff470c4f102.
Not classified: non-prose-or-short.
Readable text: verify_stderr
verify_stderr
scalar · byte 271320
Source: desktop/Cursor.app/Contents/Resources/app/extensions/cursor-agent-worker/dist/main.js, bytes 271320–271328, SHA-256 1cf2462dbf783967.
Not classified: non-prose-or-short.
Readable text: scalar
scalar
payload · byte 271339
Source: desktop/Cursor.app/Contents/Resources/app/extensions/cursor-agent-worker/dist/main.js, bytes 271339–271348, SHA-256 4039511016be9fd4.
Not classified: non-prose-or-short.
Readable text: payload
payload
verify exit code
Source: desktop/Cursor.app/Contents/Resources/app/extensions/cursor-agent-worker/dist/main.js, bytes 271362–271380, SHA-256 6d97c022008ff797.
Not classified: non-prose-or-short.
Readable text: verify_exit_code
verify_exit_code
scalar · byte 271386
Source: desktop/Cursor.app/Contents/Resources/app/extensions/cursor-agent-worker/dist/main.js, bytes 271386–271394, SHA-256 1cf2462dbf783967.
Not classified: non-prose-or-short.
Readable text: scalar
scalar
payload · byte 271405
Source: desktop/Cursor.app/Contents/Resources/app/extensions/cursor-agent-worker/dist/main.js, bytes 271405–271414, SHA-256 4039511016be9fd4.
Not classified: non-prose-or-short.
Readable text: payload
payload
start stdout
Source: desktop/Cursor.app/Contents/Resources/app/extensions/cursor-agent-worker/dist/main.js, bytes 271427–271441, SHA-256 a3c5eb5b449a2820.
Not classified: non-prose-or-short.
Readable text: start_stdout
start_stdout
scalar · byte 271447
Source: desktop/Cursor.app/Contents/Resources/app/extensions/cursor-agent-worker/dist/main.js, bytes 271447–271455, SHA-256 1cf2462dbf783967.
Not classified: non-prose-or-short.
Readable text: scalar
scalar
payload · byte 271466
Source: desktop/Cursor.app/Contents/Resources/app/extensions/cursor-agent-worker/dist/main.js, bytes 271466–271475, SHA-256 4039511016be9fd4.
Not classified: non-prose-or-short.
Readable text: payload
payload
start stderr
Source: desktop/Cursor.app/Contents/Resources/app/extensions/cursor-agent-worker/dist/main.js, bytes 271488–271502, SHA-256 7526ac1cce2482d7.
Not classified: non-prose-or-short.
Readable text: start_stderr
start_stderr
scalar · byte 271508
Source: desktop/Cursor.app/Contents/Resources/app/extensions/cursor-agent-worker/dist/main.js, bytes 271508–271516, SHA-256 1cf2462dbf783967.
Not classified: non-prose-or-short.
Readable text: scalar
scalar
payload · byte 271527
Source: desktop/Cursor.app/Contents/Resources/app/extensions/cursor-agent-worker/dist/main.js, bytes 271527–271536, SHA-256 4039511016be9fd4.
Not classified: non-prose-or-short.
Readable text: payload
payload
start exit code
Source: desktop/Cursor.app/Contents/Resources/app/extensions/cursor-agent-worker/dist/main.js, bytes 271549–271566, SHA-256 87737bd5ed82e0d8.
Not classified: non-prose-or-short.
Readable text: start_exit_code
start_exit_code
scalar · byte 271572
Source: desktop/Cursor.app/Contents/Resources/app/extensions/cursor-agent-worker/dist/main.js, bytes 271572–271580, SHA-256 1cf2462dbf783967.
Not classified: non-prose-or-short.
Readable text: scalar
scalar
payload · byte 271591
Source: desktop/Cursor.app/Contents/Resources/app/extensions/cursor-agent-worker/dist/main.js, bytes 271591–271600, SHA-256 4039511016be9fd4.
Not classified: non-prose-or-short.
Readable text: payload
payload
extension install stdout
Source: desktop/Cursor.app/Contents/Resources/app/extensions/cursor-agent-worker/dist/main.js, bytes 271614–271640, SHA-256 caab239054c12c22.
Not classified: non-prose-or-short.
Readable text: extension_install_stdout
extension_install_stdout
message · byte 271646
Source: desktop/Cursor.app/Contents/Resources/app/extensions/cursor-agent-worker/dist/main.js, bytes 271646–271655, SHA-256 fd3830a0864dd9df.
Not classified: non-prose-or-short.
Readable text: message
message
payload · byte 271667
Source: desktop/Cursor.app/Contents/Resources/app/extensions/cursor-agent-worker/dist/main.js, bytes 271667–271676, SHA-256 4039511016be9fd4.
Not classified: non-prose-or-short.
Readable text: payload
payload
extension install stderr
Source: desktop/Cursor.app/Contents/Resources/app/extensions/cursor-agent-worker/dist/main.js, bytes 271690–271716, SHA-256 427918d5d2ed2993.
Not classified: non-prose-or-short.
Readable text: extension_install_stderr
extension_install_stderr
message · byte 271722
Source: desktop/Cursor.app/Contents/Resources/app/extensions/cursor-agent-worker/dist/main.js, bytes 271722–271731, SHA-256 fd3830a0864dd9df.
Not classified: non-prose-or-short.
Readable text: message
message
payload · byte 271743
Source: desktop/Cursor.app/Contents/Resources/app/extensions/cursor-agent-worker/dist/main.js, bytes 271743–271752, SHA-256 4039511016be9fd4.
Not classified: non-prose-or-short.
Readable text: payload
payload
extension install exit code
Source: desktop/Cursor.app/Contents/Resources/app/extensions/cursor-agent-worker/dist/main.js, bytes 271766–271795, SHA-256 58cad6ee5e6967e7.
Not classified: non-prose-or-short.
Readable text: extension_install_exit_code
extension_install_exit_code
message · byte 271801
Source: desktop/Cursor.app/Contents/Resources/app/extensions/cursor-agent-worker/dist/main.js, bytes 271801–271810, SHA-256 fd3830a0864dd9df.
Not classified: non-prose-or-short.
Readable text: message
message
payload · byte 271822
Source: desktop/Cursor.app/Contents/Resources/app/extensions/cursor-agent-worker/dist/main.js, bytes 271822–271831, SHA-256 4039511016be9fd4.
Not classified: non-prose-or-short.
Readable text: payload
payload
snapshot started
Source: desktop/Cursor.app/Contents/Resources/app/extensions/cursor-agent-worker/dist/main.js, bytes 271845–271863, SHA-256 a294b18ac5a9bb57.
Not classified: non-prose-or-short.
Readable text: snapshot_started
snapshot_started
message · byte 271869
Source: desktop/Cursor.app/Contents/Resources/app/extensions/cursor-agent-worker/dist/main.js, bytes 271869–271878, SHA-256 fd3830a0864dd9df.
Not classified: non-prose-or-short.
Readable text: message
message
payload · byte 271890
Source: desktop/Cursor.app/Contents/Resources/app/extensions/cursor-agent-worker/dist/main.js, bytes 271890–271899, SHA-256 4039511016be9fd4.
Not classified: non-prose-or-short.
Readable text: payload
payload
snapshot completed
Source: desktop/Cursor.app/Contents/Resources/app/extensions/cursor-agent-worker/dist/main.js, bytes 271913–271933, SHA-256 710dc1b96617d75d.
Not classified: non-prose-or-short.
Readable text: snapshot_completed
snapshot_completed
message · byte 271939
Source: desktop/Cursor.app/Contents/Resources/app/extensions/cursor-agent-worker/dist/main.js, bytes 271939–271948, SHA-256 fd3830a0864dd9df.
Not classified: non-prose-or-short.
Readable text: message
message
payload · byte 271960
Source: desktop/Cursor.app/Contents/Resources/app/extensions/cursor-agent-worker/dist/main.js, bytes 271960–271969, SHA-256 4039511016be9fd4.
Not classified: non-prose-or-short.
Readable text: payload
payload
creation completed
Source: desktop/Cursor.app/Contents/Resources/app/extensions/cursor-agent-worker/dist/main.js, bytes 271982–272002, SHA-256 319cc487a160e2ee.
Not classified: non-prose-or-short.
Readable text: creation_completed
creation_completed
message · byte 272008
Source: desktop/Cursor.app/Contents/Resources/app/extensions/cursor-agent-worker/dist/main.js, bytes 272008–272017, SHA-256 fd3830a0864dd9df.
Not classified: non-prose-or-short.
Readable text: message
message
payload · byte 272029
Source: desktop/Cursor.app/Contents/Resources/app/extensions/cursor-agent-worker/dist/main.js, bytes 272029–272038, SHA-256 4039511016be9fd4.
Not classified: non-prose-or-short.
Readable text: payload
payload
post start stdout
Source: desktop/Cursor.app/Contents/Resources/app/extensions/cursor-agent-worker/dist/main.js, bytes 272052–272071, SHA-256 e4fc0129481beed6.
Not classified: non-prose-or-short.
Readable text: post_start_stdout
post_start_stdout
scalar · byte 272077
Source: desktop/Cursor.app/Contents/Resources/app/extensions/cursor-agent-worker/dist/main.js, bytes 272077–272085, SHA-256 1cf2462dbf783967.
Not classified: non-prose-or-short.
Readable text: scalar
scalar
payload · byte 272096
Source: desktop/Cursor.app/Contents/Resources/app/extensions/cursor-agent-worker/dist/main.js, bytes 272096–272105, SHA-256 4039511016be9fd4.
Not classified: non-prose-or-short.
Readable text: payload
payload
post start stderr
Source: desktop/Cursor.app/Contents/Resources/app/extensions/cursor-agent-worker/dist/main.js, bytes 272119–272138, SHA-256 9feb9763c515b23b.
Not classified: non-prose-or-short.
Readable text: post_start_stderr
post_start_stderr
scalar · byte 272144
Source: desktop/Cursor.app/Contents/Resources/app/extensions/cursor-agent-worker/dist/main.js, bytes 272144–272152, SHA-256 1cf2462dbf783967.
Not classified: non-prose-or-short.
Readable text: scalar
scalar
payload · byte 272163
Source: desktop/Cursor.app/Contents/Resources/app/extensions/cursor-agent-worker/dist/main.js, bytes 272163–272172, SHA-256 4039511016be9fd4.
Not classified: non-prose-or-short.
Readable text: payload
payload
post start exit code
Source: desktop/Cursor.app/Contents/Resources/app/extensions/cursor-agent-worker/dist/main.js, bytes 272186–272208, SHA-256 97a412e965928108.
Not classified: non-prose-or-short.
Readable text: post_start_exit_code
post_start_exit_code
scalar · byte 272214
Source: desktop/Cursor.app/Contents/Resources/app/extensions/cursor-agent-worker/dist/main.js, bytes 272214–272222, SHA-256 1cf2462dbf783967.
Not classified: non-prose-or-short.
Readable text: scalar
scalar
payload · byte 272233
Source: desktop/Cursor.app/Contents/Resources/app/extensions/cursor-agent-worker/dist/main.js, bytes 272233–272242, SHA-256 4039511016be9fd4.
Not classified: non-prose-or-short.
Readable text: payload
payload
extension start stdout
Source: desktop/Cursor.app/Contents/Resources/app/extensions/cursor-agent-worker/dist/main.js, bytes 272256–272280, SHA-256 4dd9c3a7b8dd9fba.
Not classified: non-prose-or-short.
Readable text: extension_start_stdout
extension_start_stdout
message · byte 272286
Source: desktop/Cursor.app/Contents/Resources/app/extensions/cursor-agent-worker/dist/main.js, bytes 272286–272295, SHA-256 fd3830a0864dd9df.
Not classified: non-prose-or-short.
Readable text: message
message
payload · byte 272307
Source: desktop/Cursor.app/Contents/Resources/app/extensions/cursor-agent-worker/dist/main.js, bytes 272307–272316, SHA-256 4039511016be9fd4.
Not classified: non-prose-or-short.
Readable text: payload
payload
extension start stderr
Source: desktop/Cursor.app/Contents/Resources/app/extensions/cursor-agent-worker/dist/main.js, bytes 272330–272354, SHA-256 5321ebf5fa909ec9.
Not classified: non-prose-or-short.
Readable text: extension_start_stderr
extension_start_stderr
message · byte 272360
Source: desktop/Cursor.app/Contents/Resources/app/extensions/cursor-agent-worker/dist/main.js, bytes 272360–272369, SHA-256 fd3830a0864dd9df.
Not classified: non-prose-or-short.
Readable text: message
message
payload · byte 272381
Source: desktop/Cursor.app/Contents/Resources/app/extensions/cursor-agent-worker/dist/main.js, bytes 272381–272390, SHA-256 4039511016be9fd4.
Not classified: non-prose-or-short.
Readable text: payload
payload
extension start exit code
Source: desktop/Cursor.app/Contents/Resources/app/extensions/cursor-agent-worker/dist/main.js, bytes 272404–272431, SHA-256 f3e5363a3529cdcb.
Not classified: non-prose-or-short.
Readable text: extension_start_exit_code
extension_start_exit_code
message · byte 272437
Source: desktop/Cursor.app/Contents/Resources/app/extensions/cursor-agent-worker/dist/main.js, bytes 272437–272446, SHA-256 fd3830a0864dd9df.
Not classified: non-prose-or-short.
Readable text: message
message
payload · byte 272458
Source: desktop/Cursor.app/Contents/Resources/app/extensions/cursor-agent-worker/dist/main.js, bytes 272458–272467, SHA-256 4039511016be9fd4.
Not classified: non-prose-or-short.
Readable text: payload
payload
startup completed
Source: desktop/Cursor.app/Contents/Resources/app/extensions/cursor-agent-worker/dist/main.js, bytes 272481–272500, SHA-256 abaf5068c8124b82.
Not classified: non-prose-or-short.
Readable text: startup_completed
startup_completed
message · byte 272506
Source: desktop/Cursor.app/Contents/Resources/app/extensions/cursor-agent-worker/dist/main.js, bytes 272506–272515, SHA-256 fd3830a0864dd9df.
Not classified: non-prose-or-short.
Readable text: message
message
payload · byte 272527
Source: desktop/Cursor.app/Contents/Resources/app/extensions/cursor-agent-worker/dist/main.js, bytes 272527–272536, SHA-256 4039511016be9fd4.
Not classified: non-prose-or-short.
Readable text: payload
payload
image pull started
Source: desktop/Cursor.app/Contents/Resources/app/extensions/cursor-agent-worker/dist/main.js, bytes 272550–272570, SHA-256 1fbc7f3fc5815e29.
Not classified: non-prose-or-short.
Readable text: image_pull_started
image_pull_started
message · byte 272576
Source: desktop/Cursor.app/Contents/Resources/app/extensions/cursor-agent-worker/dist/main.js, bytes 272576–272585, SHA-256 fd3830a0864dd9df.
Not classified: non-prose-or-short.
Readable text: message
message
payload · byte 272597
Source: desktop/Cursor.app/Contents/Resources/app/extensions/cursor-agent-worker/dist/main.js, bytes 272597–272606, SHA-256 4039511016be9fd4.
Not classified: non-prose-or-short.
Readable text: payload
payload
image pull layer update
Source: desktop/Cursor.app/Contents/Resources/app/extensions/cursor-agent-worker/dist/main.js, bytes 272620–272645, SHA-256 ec831b441f6f5bb1.
Not classified: non-prose-or-short.
Readable text: image_pull_layer_update
image_pull_layer_update
message · byte 272651
Source: desktop/Cursor.app/Contents/Resources/app/extensions/cursor-agent-worker/dist/main.js, bytes 272651–272660, SHA-256 fd3830a0864dd9df.
Not classified: non-prose-or-short.
Readable text: message
message
payload · byte 272672
Source: desktop/Cursor.app/Contents/Resources/app/extensions/cursor-agent-worker/dist/main.js, bytes 272672–272681, SHA-256 4039511016be9fd4.
Not classified: non-prose-or-short.
Readable text: payload
payload
image pull status update
Source: desktop/Cursor.app/Contents/Resources/app/extensions/cursor-agent-worker/dist/main.js, bytes 272695–272721, SHA-256 e6a7589db70958db.
Not classified: non-prose-or-short.
Readable text: image_pull_status_update
image_pull_status_update
message · byte 272727
Source: desktop/Cursor.app/Contents/Resources/app/extensions/cursor-agent-worker/dist/main.js, bytes 272727–272736, SHA-256 fd3830a0864dd9df.
Not classified: non-prose-or-short.
Readable text: message
message
payload · byte 272748
Source: desktop/Cursor.app/Contents/Resources/app/extensions/cursor-agent-worker/dist/main.js, bytes 272748–272757, SHA-256 4039511016be9fd4.
Not classified: non-prose-or-short.
Readable text: payload
payload
image pull completed
Source: desktop/Cursor.app/Contents/Resources/app/extensions/cursor-agent-worker/dist/main.js, bytes 272771–272793, SHA-256 880347c16bd30190.
Not classified: non-prose-or-short.
Readable text: image_pull_completed
image_pull_completed
message · byte 272799
Source: desktop/Cursor.app/Contents/Resources/app/extensions/cursor-agent-worker/dist/main.js, bytes 272799–272808, SHA-256 fd3830a0864dd9df.
Not classified: non-prose-or-short.
Readable text: message
message
payload · byte 272820
Source: desktop/Cursor.app/Contents/Resources/app/extensions/cursor-agent-worker/dist/main.js, bytes 272820–272829, SHA-256 4039511016be9fd4.
Not classified: non-prose-or-short.
Readable text: payload
payload
blocked repo state
Source: desktop/Cursor.app/Contents/Resources/app/extensions/cursor-agent-worker/dist/main.js, bytes 272843–272863, SHA-256 39ea188e43844aec.
Not classified: non-prose-or-short.
Readable text: blocked_repo_state
blocked_repo_state
message · byte 272869
Source: desktop/Cursor.app/Contents/Resources/app/extensions/cursor-agent-worker/dist/main.js, bytes 272869–272878, SHA-256 fd3830a0864dd9df.
Not classified: non-prose-or-short.
Readable text: message
message
payload · byte 272890
Source: desktop/Cursor.app/Contents/Resources/app/extensions/cursor-agent-worker/dist/main.js, bytes 272890–272899, SHA-256 4039511016be9fd4.
Not classified: non-prose-or-short.
Readable text: payload
payload
acquired repo state
Source: desktop/Cursor.app/Contents/Resources/app/extensions/cursor-agent-worker/dist/main.js, bytes 272913–272934, SHA-256 72e7e889eff75d3c.
Not classified: non-prose-or-short.
Readable text: acquired_repo_state
acquired_repo_state
message · byte 272940
Source: desktop/Cursor.app/Contents/Resources/app/extensions/cursor-agent-worker/dist/main.js, bytes 272940–272949, SHA-256 fd3830a0864dd9df.
Not classified: non-prose-or-short.
Readable text: message
message
payload · byte 272961
Source: desktop/Cursor.app/Contents/Resources/app/extensions/cursor-agent-worker/dist/main.js, bytes 272961–272970, SHA-256 4039511016be9fd4.
Not classified: non-prose-or-short.
Readable text: payload
payload
private worker ready
Source: desktop/Cursor.app/Contents/Resources/app/extensions/cursor-agent-worker/dist/main.js, bytes 272984–273006, SHA-256 d4a3db4132ecc4dc.
Not classified: non-prose-or-short.
Readable text: private_worker_ready
private_worker_ready
message · byte 273012
Source: desktop/Cursor.app/Contents/Resources/app/extensions/cursor-agent-worker/dist/main.js, bytes 273012–273021, SHA-256 fd3830a0864dd9df.
Not classified: non-prose-or-short.
Readable text: message
message
payload · byte 273033
Source: desktop/Cursor.app/Contents/Resources/app/extensions/cursor-agent-worker/dist/main.js, bytes 273033–273042, SHA-256 4039511016be9fd4.
Not classified: non-prose-or-short.
Readable text: payload
payload
waiting for worker
Source: desktop/Cursor.app/Contents/Resources/app/extensions/cursor-agent-worker/dist/main.js, bytes 273056–273076, SHA-256 c3bc18f574413a27.
Not classified: non-prose-or-short.
Readable text: waiting_for_worker
waiting_for_worker
message · byte 273082
Source: desktop/Cursor.app/Contents/Resources/app/extensions/cursor-agent-worker/dist/main.js, bytes 273082–273091, SHA-256 fd3830a0864dd9df.
Not classified: non-prose-or-short.
Readable text: message
message
payload · byte 273103
Source: desktop/Cursor.app/Contents/Resources/app/extensions/cursor-agent-worker/dist/main.js, bytes 273103–273112, SHA-256 4039511016be9fd4.
Not classified: non-prose-or-short.
Readable text: payload
payload
span started
Source: desktop/Cursor.app/Contents/Resources/app/extensions/cursor-agent-worker/dist/main.js, bytes 273126–273140, SHA-256 90cea8b85be1351c.
Not classified: non-prose-or-short.
Readable text: span_started
span_started
message · byte 273146
Source: desktop/Cursor.app/Contents/Resources/app/extensions/cursor-agent-worker/dist/main.js, bytes 273146–273155, SHA-256 fd3830a0864dd9df.
Not classified: non-prose-or-short.
Readable text: message
message
payload · byte 273167
Source: desktop/Cursor.app/Contents/Resources/app/extensions/cursor-agent-worker/dist/main.js, bytes 273167–273176, SHA-256 4039511016be9fd4.
Not classified: non-prose-or-short.
Readable text: payload
payload
span ended
Source: desktop/Cursor.app/Contents/Resources/app/extensions/cursor-agent-worker/dist/main.js, bytes 273190–273202, SHA-256 ee5428d38c0bcac9.
Not classified: non-prose-or-short.
Readable text: span_ended
span_ended
message · byte 273208
Source: desktop/Cursor.app/Contents/Resources/app/extensions/cursor-agent-worker/dist/main.js, bytes 273208–273217, SHA-256 fd3830a0864dd9df.
Not classified: non-prose-or-short.
Readable text: message
message
payload · byte 273229
Source: desktop/Cursor.app/Contents/Resources/app/extensions/cursor-agent-worker/dist/main.js, bytes 273229–273238, SHA-256 4039511016be9fd4.
Not classified: non-prose-or-short.
Readable text: payload
payload
lifecycle process restarted
Source: desktop/Cursor.app/Contents/Resources/app/extensions/cursor-agent-worker/dist/main.js, bytes 273252–273281, SHA-256 ea31e9ad667771a2.
Not classified: non-prose-or-short.
Readable text: lifecycle_process_restarted
lifecycle_process_restarted
message · byte 273287
Source: desktop/Cursor.app/Contents/Resources/app/extensions/cursor-agent-worker/dist/main.js, bytes 273287–273296, SHA-256 fd3830a0864dd9df.
Not classified: non-prose-or-short.
Readable text: message
message
payload · byte 273308
Source: desktop/Cursor.app/Contents/Resources/app/extensions/cursor-agent-worker/dist/main.js, bytes 273308–273317, SHA-256 4039511016be9fd4.
Not classified: non-prose-or-short.
Readable text: payload
payload
lifecycle process exited
Source: desktop/Cursor.app/Contents/Resources/app/extensions/cursor-agent-worker/dist/main.js, bytes 273331–273357, SHA-256 4958219ff4ca1c73.
Not classified: non-prose-or-short.
Readable text: lifecycle_process_exited
lifecycle_process_exited
message · byte 273363
Source: desktop/Cursor.app/Contents/Resources/app/extensions/cursor-agent-worker/dist/main.js, bytes 273363–273372, SHA-256 fd3830a0864dd9df.
Not classified: non-prose-or-short.
Readable text: message
message
payload · byte 273384
Source: desktop/Cursor.app/Contents/Resources/app/extensions/cursor-agent-worker/dist/main.js, bytes 273384–273393, SHA-256 4039511016be9fd4.
Not classified: non-prose-or-short.
Readable text: payload
payload
anyrun.v1.LifecycleProcessRestarted
Source: desktop/Cursor.app/Contents/Resources/app/extensions/cursor-agent-worker/dist/main.js, bytes 273419–273456, SHA-256 f922d3272b1b7d7f.
Not classified: non-prose-or-short.
Readable text: anyrun.v1.LifecycleProcessRestarted
anyrun.v1.LifecycleProcessRestarted
attempt
Source: desktop/Cursor.app/Contents/Resources/app/extensions/cursor-agent-worker/dist/main.js, bytes 273473–273482, SHA-256 7fd8a75515662fde.
Not classified: non-prose-or-short.
Readable text: attempt
attempt
scalar · byte 273488
Source: desktop/Cursor.app/Contents/Resources/app/extensions/cursor-agent-worker/dist/main.js, bytes 273488–273496, SHA-256 1cf2462dbf783967.
Not classified: non-prose-or-short.
Readable text: scalar
scalar
previous exit code
Source: desktop/Cursor.app/Contents/Resources/app/extensions/cursor-agent-worker/dist/main.js, bytes 273514–273534, SHA-256 42f4c82c94303bb3.
Not classified: non-prose-or-short.
Readable text: previous_exit_code
previous_exit_code
scalar · byte 273540
Source: desktop/Cursor.app/Contents/Resources/app/extensions/cursor-agent-worker/dist/main.js, bytes 273540–273548, SHA-256 1cf2462dbf783967.
Not classified: non-prose-or-short.
Readable text: scalar
scalar
reason
Source: desktop/Cursor.app/Contents/Resources/app/extensions/cursor-agent-worker/dist/main.js, bytes 273565–273573, SHA-256 5c92521b872208bb.
Not classified: non-prose-or-short.
Readable text: reason
reason
enum
Source: desktop/Cursor.app/Contents/Resources/app/extensions/cursor-agent-worker/dist/main.js, bytes 273579–273585, SHA-256 e49fb5f753e8aa4d.
Not classified: non-prose-or-short.
Readable text: enum
enum
command name
Source: desktop/Cursor.app/Contents/Resources/app/extensions/cursor-agent-worker/dist/main.js, bytes 273619–273633, SHA-256 2f29d90b8ae83d4d.
Not classified: non-prose-or-short.
Readable text: command_name
command_name
scalar · byte 273639
Source: desktop/Cursor.app/Contents/Resources/app/extensions/cursor-agent-worker/dist/main.js, bytes 273639–273647, SHA-256 1cf2462dbf783967.
Not classified: non-prose-or-short.
Readable text: scalar
scalar
anyrun.v1.LifecycleProcessExited
Source: desktop/Cursor.app/Contents/Resources/app/extensions/cursor-agent-worker/dist/main.js, bytes 273677–273711, SHA-256 751a8afc955565cd.
Not classified: non-prose-or-short.
Readable text: anyrun.v1.LifecycleProcessExited
anyrun.v1.LifecycleProcessExited
exit code
Source: desktop/Cursor.app/Contents/Resources/app/extensions/cursor-agent-worker/dist/main.js, bytes 273728–273739, SHA-256 f3a2ff6c1c655209.
Not classified: non-prose-or-short.
Readable text: exit_code
exit_code
scalar · byte 273745
Source: desktop/Cursor.app/Contents/Resources/app/extensions/cursor-agent-worker/dist/main.js, bytes 273745–273753, SHA-256 1cf2462dbf783967.
Not classified: non-prose-or-short.
Readable text: scalar
scalar
command name · byte 273770
Source: desktop/Cursor.app/Contents/Resources/app/extensions/cursor-agent-worker/dist/main.js, bytes 273770–273784, SHA-256 2f29d90b8ae83d4d.
Not classified: non-prose-or-short.
Readable text: command_name
command_name
scalar · byte 273790
Source: desktop/Cursor.app/Contents/Resources/app/extensions/cursor-agent-worker/dist/main.js, bytes 273790–273798, SHA-256 1cf2462dbf783967.
Not classified: non-prose-or-short.
Readable text: scalar
scalar
anyrun.v1.SpanStarted
Source: desktop/Cursor.app/Contents/Resources/app/extensions/cursor-agent-worker/dist/main.js, bytes 273828–273851, SHA-256 eaa315e9b78d0906.
Not classified: non-prose-or-short.
Readable text: anyrun.v1.SpanStarted
anyrun.v1.SpanStarted
span id
Source: desktop/Cursor.app/Contents/Resources/app/extensions/cursor-agent-worker/dist/main.js, bytes 273868–273877, SHA-256 5dd09dec2a912c98.
Not classified: non-prose-or-short.
Readable text: span_id
span_id
scalar · byte 273883
Source: desktop/Cursor.app/Contents/Resources/app/extensions/cursor-agent-worker/dist/main.js, bytes 273883–273891, SHA-256 1cf2462dbf783967.
Not classified: non-prose-or-short.
Readable text: scalar
scalar
name
Source: desktop/Cursor.app/Contents/Resources/app/extensions/cursor-agent-worker/dist/main.js, bytes 273908–273914, SHA-256 6ffe58b85cad95f1.
Not classified: non-prose-or-short.
Readable text: name
name
scalar · byte 273920
Source: desktop/Cursor.app/Contents/Resources/app/extensions/cursor-agent-worker/dist/main.js, bytes 273920–273928, SHA-256 1cf2462dbf783967.
Not classified: non-prose-or-short.
Readable text: scalar
scalar
parent span id
Source: desktop/Cursor.app/Contents/Resources/app/extensions/cursor-agent-worker/dist/main.js, bytes 273945–273961, SHA-256 c5c1a60c809cd9dc.
Not classified: non-prose-or-short.
Readable text: parent_span_id
parent_span_id
scalar · byte 273967
Source: desktop/Cursor.app/Contents/Resources/app/extensions/cursor-agent-worker/dist/main.js, bytes 273967–273975, SHA-256 1cf2462dbf783967.
Not classified: non-prose-or-short.
Readable text: scalar
scalar
href
Source: desktop/Cursor.app/Contents/Resources/app/extensions/cursor-agent-worker/dist/main.js, bytes 273999–274005, SHA-256 27c4f5735ec55aaa.
Not classified: non-prose-or-short.
Readable text: href
href
scalar · byte 274011
Source: desktop/Cursor.app/Contents/Resources/app/extensions/cursor-agent-worker/dist/main.js, bytes 274011–274019, SHA-256 1cf2462dbf783967.
Not classified: non-prose-or-short.
Readable text: scalar
scalar
anyrun.v1.SpanEnded
Source: desktop/Cursor.app/Contents/Resources/app/extensions/cursor-agent-worker/dist/main.js, bytes 274056–274077, SHA-256 733ee91a4b5f99be.
Not classified: non-prose-or-short.
Readable text: anyrun.v1.SpanEnded
anyrun.v1.SpanEnded
span id · byte 274094
Source: desktop/Cursor.app/Contents/Resources/app/extensions/cursor-agent-worker/dist/main.js, bytes 274094–274103, SHA-256 5dd09dec2a912c98.
Not classified: non-prose-or-short.
Readable text: span_id
span_id
scalar · byte 274109
Source: desktop/Cursor.app/Contents/Resources/app/extensions/cursor-agent-worker/dist/main.js, bytes 274109–274117, SHA-256 1cf2462dbf783967.
Not classified: non-prose-or-short.
Readable text: scalar
scalar
anyrun.v1.WaitingForWorkerStatus
Source: desktop/Cursor.app/Contents/Resources/app/extensions/cursor-agent-worker/dist/main.js, bytes 274147–274181, SHA-256 8d044ac3cc5fdffd.
Not classified: non-prose-or-short.
Readable text: anyrun.v1.WaitingForWorkerStatus
anyrun.v1.WaitingForWorkerStatus
retry count
Source: desktop/Cursor.app/Contents/Resources/app/extensions/cursor-agent-worker/dist/main.js, bytes 274198–274211, SHA-256 5855720152cfe070.
Not classified: non-prose-or-short.
Readable text: retry_count
retry_count
scalar · byte 274217
Source: desktop/Cursor.app/Contents/Resources/app/extensions/cursor-agent-worker/dist/main.js, bytes 274217–274225, SHA-256 1cf2462dbf783967.
Not classified: non-prose-or-short.
Readable text: scalar
scalar
max retries
Source: desktop/Cursor.app/Contents/Resources/app/extensions/cursor-agent-worker/dist/main.js, bytes 274242–274255, SHA-256 ddb82068b8c7cedc.
Not classified: non-prose-or-short.
Readable text: max_retries
max_retries
scalar · byte 274261
Source: desktop/Cursor.app/Contents/Resources/app/extensions/cursor-agent-worker/dist/main.js, bytes 274261–274269, SHA-256 1cf2462dbf783967.
Not classified: non-prose-or-short.
Readable text: scalar
scalar
wait reason
Source: desktop/Cursor.app/Contents/Resources/app/extensions/cursor-agent-worker/dist/main.js, bytes 274286–274299, SHA-256 48fa9a69306b05ce.
Not classified: non-prose-or-short.
Readable text: wait_reason
wait_reason
enum · byte 274305
Source: desktop/Cursor.app/Contents/Resources/app/extensions/cursor-agent-worker/dist/main.js, bytes 274305–274311, SHA-256 e49fb5f753e8aa4d.
Not classified: non-prose-or-short.
Readable text: enum
enum
anyrun.v1.HydrationProgress
Source: desktop/Cursor.app/Contents/Resources/app/extensions/cursor-agent-worker/dist/main.js, bytes 274358–274387, SHA-256 a53f58a71be42ccf.
Not classified: non-prose-or-short.
Readable text: anyrun.v1.HydrationProgress
anyrun.v1.HydrationProgress
transferred
Source: desktop/Cursor.app/Contents/Resources/app/extensions/cursor-agent-worker/dist/main.js, bytes 274404–274417, SHA-256 4dfbcb537e2f1f4e.
Not classified: non-prose-or-short.
Readable text: transferred
transferred
scalar · byte 274423
Source: desktop/Cursor.app/Contents/Resources/app/extensions/cursor-agent-worker/dist/main.js, bytes 274423–274431, SHA-256 1cf2462dbf783967.
Not classified: non-prose-or-short.
Readable text: scalar
scalar
total
Source: desktop/Cursor.app/Contents/Resources/app/extensions/cursor-agent-worker/dist/main.js, bytes 274448–274455, SHA-256 714bdb4ba7da01e5.
Not classified: non-prose-or-short.
Readable text: total
total
scalar · byte 274461
Source: desktop/Cursor.app/Contents/Resources/app/extensions/cursor-agent-worker/dist/main.js, bytes 274461–274469, SHA-256 1cf2462dbf783967.
Not classified: non-prose-or-short.
Readable text: scalar
scalar
anyrun.v1.PodErrorEvent
Source: desktop/Cursor.app/Contents/Resources/app/extensions/cursor-agent-worker/dist/main.js, bytes 274499–274524, SHA-256 a36376f58e861733.
Not classified: non-prose-or-short.
Readable text: anyrun.v1.PodErrorEvent
anyrun.v1.PodErrorEvent
error message
Source: desktop/Cursor.app/Contents/Resources/app/extensions/cursor-agent-worker/dist/main.js, bytes 274541–274556, SHA-256 10b3b1d66621d65b.
Not classified: non-prose-or-short.
Readable text: error_message
error_message
scalar · byte 274562
Source: desktop/Cursor.app/Contents/Resources/app/extensions/cursor-agent-worker/dist/main.js, bytes 274562–274570, SHA-256 1cf2462dbf783967.
Not classified: non-prose-or-short.
Readable text: scalar
scalar
anyrun.v1.FeatureOutput
Source: desktop/Cursor.app/Contents/Resources/app/extensions/cursor-agent-worker/dist/main.js, bytes 274600–274625, SHA-256 64591ceb2f8ca887.
Not classified: non-prose-or-short.
Readable text: anyrun.v1.FeatureOutput
anyrun.v1.FeatureOutput
feature id
Source: desktop/Cursor.app/Contents/Resources/app/extensions/cursor-agent-worker/dist/main.js, bytes 274642–274654, SHA-256 d5fd9e3da0456c9b.
Not classified: non-prose-or-short.
Readable text: feature_id
feature_id
scalar · byte 274660
Source: desktop/Cursor.app/Contents/Resources/app/extensions/cursor-agent-worker/dist/main.js, bytes 274660–274668, SHA-256 1cf2462dbf783967.
Not classified: non-prose-or-short.
Readable text: scalar
scalar
output
Source: desktop/Cursor.app/Contents/Resources/app/extensions/cursor-agent-worker/dist/main.js, bytes 274685–274693, SHA-256 4bbb1f9446ff0829.
Not classified: non-prose-or-short.
Readable text: output
output
scalar · byte 274699
Source: desktop/Cursor.app/Contents/Resources/app/extensions/cursor-agent-worker/dist/main.js, bytes 274699–274707, SHA-256 1cf2462dbf783967.
Not classified: non-prose-or-short.
Readable text: scalar
scalar
anyrun.v1.FeatureExitCode
Source: desktop/Cursor.app/Contents/Resources/app/extensions/cursor-agent-worker/dist/main.js, bytes 274737–274764, SHA-256 f0db1fd37b9fef52.
Not classified: non-prose-or-short.
Readable text: anyrun.v1.FeatureExitCode
anyrun.v1.FeatureExitCode
feature id · byte 274781
Source: desktop/Cursor.app/Contents/Resources/app/extensions/cursor-agent-worker/dist/main.js, bytes 274781–274793, SHA-256 d5fd9e3da0456c9b.
Not classified: non-prose-or-short.
Readable text: feature_id
feature_id
scalar · byte 274799
Source: desktop/Cursor.app/Contents/Resources/app/extensions/cursor-agent-worker/dist/main.js, bytes 274799–274807, SHA-256 1cf2462dbf783967.
Not classified: non-prose-or-short.
Readable text: scalar
scalar
exit code · byte 274824
Source: desktop/Cursor.app/Contents/Resources/app/extensions/cursor-agent-worker/dist/main.js, bytes 274824–274835, SHA-256 f3a2ff6c1c655209.
Not classified: non-prose-or-short.
Readable text: exit_code
exit_code
scalar · byte 274841
Source: desktop/Cursor.app/Contents/Resources/app/extensions/cursor-agent-worker/dist/main.js, bytes 274841–274849, SHA-256 1cf2462dbf783967.
Not classified: non-prose-or-short.
Readable text: scalar
scalar
anyrun.v1.BuildStepStarted
Source: desktop/Cursor.app/Contents/Resources/app/extensions/cursor-agent-worker/dist/main.js, bytes 274879–274907, SHA-256 00b3089b02f3dae7.
Not classified: non-prose-or-short.
Readable text: anyrun.v1.BuildStepStarted
anyrun.v1.BuildStepStarted
stream id
Source: desktop/Cursor.app/Contents/Resources/app/extensions/cursor-agent-worker/dist/main.js, bytes 274924–274935, SHA-256 d568da20b13aebdb.
Not classified: non-prose-or-short.
Readable text: stream_id
stream_id
scalar · byte 274941
Source: desktop/Cursor.app/Contents/Resources/app/extensions/cursor-agent-worker/dist/main.js, bytes 274941–274949, SHA-256 1cf2462dbf783967.
Not classified: non-prose-or-short.
Readable text: scalar
scalar
step
Source: desktop/Cursor.app/Contents/Resources/app/extensions/cursor-agent-worker/dist/main.js, bytes 274967–274973, SHA-256 0d9f50d8178cb7c5.
Not classified: non-prose-or-short.
Readable text: step
step
scalar · byte 274979
Source: desktop/Cursor.app/Contents/Resources/app/extensions/cursor-agent-worker/dist/main.js, bytes 274979–274987, SHA-256 1cf2462dbf783967.
Not classified: non-prose-or-short.
Readable text: scalar
scalar
total steps
Source: desktop/Cursor.app/Contents/Resources/app/extensions/cursor-agent-worker/dist/main.js, bytes 275005–275018, SHA-256 782b4d825e97866b.
Not classified: non-prose-or-short.
Readable text: total_steps
total_steps
scalar · byte 275024
Source: desktop/Cursor.app/Contents/Resources/app/extensions/cursor-agent-worker/dist/main.js, bytes 275024–275032, SHA-256 1cf2462dbf783967.
Not classified: non-prose-or-short.
Readable text: scalar
scalar
command
Source: desktop/Cursor.app/Contents/Resources/app/extensions/cursor-agent-worker/dist/main.js, bytes 275050–275059, SHA-256 015216f42e276406.
Not classified: non-prose-or-short.
Readable text: command
command
scalar · byte 275065
Source: desktop/Cursor.app/Contents/Resources/app/extensions/cursor-agent-worker/dist/main.js, bytes 275065–275073, SHA-256 1cf2462dbf783967.
Not classified: non-prose-or-short.
Readable text: scalar
scalar
anyrun.v1.BuildStatusLine
Source: desktop/Cursor.app/Contents/Resources/app/extensions/cursor-agent-worker/dist/main.js, bytes 275103–275130, SHA-256 040101883b3e2b3d.
Not classified: non-prose-or-short.
Readable text: anyrun.v1.BuildStatusLine
anyrun.v1.BuildStatusLine
stream id · byte 275147
Source: desktop/Cursor.app/Contents/Resources/app/extensions/cursor-agent-worker/dist/main.js, bytes 275147–275158, SHA-256 d568da20b13aebdb.
Not classified: non-prose-or-short.
Readable text: stream_id
stream_id
scalar · byte 275164
Source: desktop/Cursor.app/Contents/Resources/app/extensions/cursor-agent-worker/dist/main.js, bytes 275164–275172, SHA-256 1cf2462dbf783967.
Not classified: non-prose-or-short.
Readable text: scalar
scalar
timestamp
Source: desktop/Cursor.app/Contents/Resources/app/extensions/cursor-agent-worker/dist/main.js, bytes 275190–275201, SHA-256 e0676e0684d82ef5.
Not classified: non-prose-or-short.
Readable text: timestamp
timestamp
scalar · byte 275207
Source: desktop/Cursor.app/Contents/Resources/app/extensions/cursor-agent-worker/dist/main.js, bytes 275207–275215, SHA-256 1cf2462dbf783967.
Not classified: non-prose-or-short.
Readable text: scalar
scalar
content
Source: desktop/Cursor.app/Contents/Resources/app/extensions/cursor-agent-worker/dist/main.js, bytes 275232–275241, SHA-256 b09c7d54e7dd3d63.
Not classified: non-prose-or-short.
Readable text: content
content
scalar · byte 275247
Source: desktop/Cursor.app/Contents/Resources/app/extensions/cursor-agent-worker/dist/main.js, bytes 275247–275255, SHA-256 1cf2462dbf783967.
Not classified: non-prose-or-short.
Readable text: scalar
scalar
anyrun.v1.InternalBuildMessage
Source: desktop/Cursor.app/Contents/Resources/app/extensions/cursor-agent-worker/dist/main.js, bytes 275285–275317, SHA-256 948fecae1fbb09b1.
Not classified: non-prose-or-short.
Readable text: anyrun.v1.InternalBuildMessage
anyrun.v1.InternalBuildMessage
stream id · byte 275334
Source: desktop/Cursor.app/Contents/Resources/app/extensions/cursor-agent-worker/dist/main.js, bytes 275334–275345, SHA-256 d568da20b13aebdb.
Not classified: non-prose-or-short.
Readable text: stream_id
stream_id
scalar · byte 275351
Source: desktop/Cursor.app/Contents/Resources/app/extensions/cursor-agent-worker/dist/main.js, bytes 275351–275359, SHA-256 1cf2462dbf783967.
Not classified: non-prose-or-short.
Readable text: scalar
scalar
content · byte 275377
Source: desktop/Cursor.app/Contents/Resources/app/extensions/cursor-agent-worker/dist/main.js, bytes 275377–275386, SHA-256 b09c7d54e7dd3d63.
Not classified: non-prose-or-short.
Readable text: content
content
scalar · byte 275392
Source: desktop/Cursor.app/Contents/Resources/app/extensions/cursor-agent-worker/dist/main.js, bytes 275392–275400, SHA-256 1cf2462dbf783967.
Not classified: non-prose-or-short.
Readable text: scalar
scalar
anyrun.v1.ImagePullStarted
Source: desktop/Cursor.app/Contents/Resources/app/extensions/cursor-agent-worker/dist/main.js, bytes 275430–275458, SHA-256 e78744630415c928.
Not classified: non-prose-or-short.
Readable text: anyrun.v1.ImagePullStarted
anyrun.v1.ImagePullStarted
image name
Source: desktop/Cursor.app/Contents/Resources/app/extensions/cursor-agent-worker/dist/main.js, bytes 275475–275487, SHA-256 be2fd74ab26d082c.
Not classified: non-prose-or-short.
Readable text: image_name
image_name
scalar · byte 275493
Source: desktop/Cursor.app/Contents/Resources/app/extensions/cursor-agent-worker/dist/main.js, bytes 275493–275501, SHA-256 1cf2462dbf783967.
Not classified: non-prose-or-short.
Readable text: scalar
scalar
pull id
Source: desktop/Cursor.app/Contents/Resources/app/extensions/cursor-agent-worker/dist/main.js, bytes 275518–275527, SHA-256 945c37c27ff26682.
Not classified: non-prose-or-short.
Readable text: pull_id
pull_id
scalar · byte 275533
Source: desktop/Cursor.app/Contents/Resources/app/extensions/cursor-agent-worker/dist/main.js, bytes 275533–275541, SHA-256 1cf2462dbf783967.
Not classified: non-prose-or-short.
Readable text: scalar
scalar
anyrun.v1.ImagePullLayerUpdate
Source: desktop/Cursor.app/Contents/Resources/app/extensions/cursor-agent-worker/dist/main.js, bytes 275571–275603, SHA-256 ae5c7202ac280a19.
Not classified: non-prose-or-short.
Readable text: anyrun.v1.ImagePullLayerUpdate
anyrun.v1.ImagePullLayerUpdate
image name · byte 275620
Source: desktop/Cursor.app/Contents/Resources/app/extensions/cursor-agent-worker/dist/main.js, bytes 275620–275632, SHA-256 be2fd74ab26d082c.
Not classified: non-prose-or-short.
Readable text: image_name
image_name
scalar · byte 275638
Source: desktop/Cursor.app/Contents/Resources/app/extensions/cursor-agent-worker/dist/main.js, bytes 275638–275646, SHA-256 1cf2462dbf783967.
Not classified: non-prose-or-short.
Readable text: scalar
scalar
pull id · byte 275663
Source: desktop/Cursor.app/Contents/Resources/app/extensions/cursor-agent-worker/dist/main.js, bytes 275663–275672, SHA-256 945c37c27ff26682.
Not classified: non-prose-or-short.
Readable text: pull_id
pull_id
scalar · byte 275678
Source: desktop/Cursor.app/Contents/Resources/app/extensions/cursor-agent-worker/dist/main.js, bytes 275678–275686, SHA-256 1cf2462dbf783967.
Not classified: non-prose-or-short.
Readable text: scalar
scalar
layer id
Source: desktop/Cursor.app/Contents/Resources/app/extensions/cursor-agent-worker/dist/main.js, bytes 275703–275713, SHA-256 b8f2a5790bf9b410.
Not classified: non-prose-or-short.
Readable text: layer_id
layer_id
scalar · byte 275719
Source: desktop/Cursor.app/Contents/Resources/app/extensions/cursor-agent-worker/dist/main.js, bytes 275719–275727, SHA-256 1cf2462dbf783967.
Not classified: non-prose-or-short.
Readable text: scalar
scalar
pulling fs layer
Source: desktop/Cursor.app/Contents/Resources/app/extensions/cursor-agent-worker/dist/main.js, bytes 275744–275762, SHA-256 93304e7b31c6a60a.
Not classified: non-prose-or-short.
Readable text: pulling_fs_layer
pulling_fs_layer
scalar · byte 275768
Source: desktop/Cursor.app/Contents/Resources/app/extensions/cursor-agent-worker/dist/main.js, bytes 275768–275776, SHA-256 1cf2462dbf783967.
Not classified: non-prose-or-short.
Readable text: scalar
scalar
status
Source: desktop/Cursor.app/Contents/Resources/app/extensions/cursor-agent-worker/dist/main.js, bytes 275787–275795, SHA-256 cfc31bcc34ed7f4c.
Not classified: non-prose-or-short.
Readable text: status
status
waiting
Source: desktop/Cursor.app/Contents/Resources/app/extensions/cursor-agent-worker/dist/main.js, bytes 275808–275817, SHA-256 71ce8ff4c1791880.
Not classified: non-prose-or-short.
Readable text: waiting
waiting
scalar · byte 275823
Source: desktop/Cursor.app/Contents/Resources/app/extensions/cursor-agent-worker/dist/main.js, bytes 275823–275831, SHA-256 1cf2462dbf783967.
Not classified: non-prose-or-short.
Readable text: scalar
scalar
status · byte 275842
Source: desktop/Cursor.app/Contents/Resources/app/extensions/cursor-agent-worker/dist/main.js, bytes 275842–275850, SHA-256 cfc31bcc34ed7f4c.
Not classified: non-prose-or-short.
Readable text: status
status
verifying checksum
Source: desktop/Cursor.app/Contents/Resources/app/extensions/cursor-agent-worker/dist/main.js, bytes 275863–275883, SHA-256 e50ef7c8f527a6c8.
Not classified: non-prose-or-short.
Readable text: verifying_checksum
verifying_checksum
scalar · byte 275889
Source: desktop/Cursor.app/Contents/Resources/app/extensions/cursor-agent-worker/dist/main.js, bytes 275889–275897, SHA-256 1cf2462dbf783967.
Not classified: non-prose-or-short.
Readable text: scalar
scalar
status · byte 275908
Source: desktop/Cursor.app/Contents/Resources/app/extensions/cursor-agent-worker/dist/main.js, bytes 275908–275916, SHA-256 cfc31bcc34ed7f4c.
Not classified: non-prose-or-short.
Readable text: status
status
download complete
Source: desktop/Cursor.app/Contents/Resources/app/extensions/cursor-agent-worker/dist/main.js, bytes 275929–275948, SHA-256 4fef0bb855579b6f.
Not classified: non-prose-or-short.
Readable text: download_complete
download_complete
scalar · byte 275954
Source: desktop/Cursor.app/Contents/Resources/app/extensions/cursor-agent-worker/dist/main.js, bytes 275954–275962, SHA-256 1cf2462dbf783967.
Not classified: non-prose-or-short.
Readable text: scalar
scalar
status · byte 275973
Source: desktop/Cursor.app/Contents/Resources/app/extensions/cursor-agent-worker/dist/main.js, bytes 275973–275981, SHA-256 cfc31bcc34ed7f4c.
Not classified: non-prose-or-short.
Readable text: status
status
pull complete
Source: desktop/Cursor.app/Contents/Resources/app/extensions/cursor-agent-worker/dist/main.js, bytes 275994–276009, SHA-256 ddae3a6bedea6d16.
Not classified: non-prose-or-short.
Readable text: pull_complete
pull_complete
scalar · byte 276015
Source: desktop/Cursor.app/Contents/Resources/app/extensions/cursor-agent-worker/dist/main.js, bytes 276015–276023, SHA-256 1cf2462dbf783967.
Not classified: non-prose-or-short.
Readable text: scalar
scalar
status · byte 276034
Source: desktop/Cursor.app/Contents/Resources/app/extensions/cursor-agent-worker/dist/main.js, bytes 276034–276042, SHA-256 cfc31bcc34ed7f4c.
Not classified: non-prose-or-short.
Readable text: status
status
downloading
Source: desktop/Cursor.app/Contents/Resources/app/extensions/cursor-agent-worker/dist/main.js, bytes 276055–276068, SHA-256 544c45e75c44efca.
Not classified: non-prose-or-short.
Readable text: downloading
downloading
message · byte 276074
Source: desktop/Cursor.app/Contents/Resources/app/extensions/cursor-agent-worker/dist/main.js, bytes 276074–276083, SHA-256 fd3830a0864dd9df.
Not classified: non-prose-or-short.
Readable text: message
message
status · byte 276095
Source: desktop/Cursor.app/Contents/Resources/app/extensions/cursor-agent-worker/dist/main.js, bytes 276095–276103, SHA-256 cfc31bcc34ed7f4c.
Not classified: non-prose-or-short.
Readable text: status
status
extracting
Source: desktop/Cursor.app/Contents/Resources/app/extensions/cursor-agent-worker/dist/main.js, bytes 276117–276129, SHA-256 94936815c9ffdae8.
Not classified: non-prose-or-short.
Readable text: extracting
extracting
message · byte 276135
Source: desktop/Cursor.app/Contents/Resources/app/extensions/cursor-agent-worker/dist/main.js, bytes 276135–276144, SHA-256 fd3830a0864dd9df.
Not classified: non-prose-or-short.
Readable text: message
message
status · byte 276156
Source: desktop/Cursor.app/Contents/Resources/app/extensions/cursor-agent-worker/dist/main.js, bytes 276156–276164, SHA-256 cfc31bcc34ed7f4c.
Not classified: non-prose-or-short.
Readable text: status
status
other
Source: desktop/Cursor.app/Contents/Resources/app/extensions/cursor-agent-worker/dist/main.js, bytes 276178–276185, SHA-256 d448c0e0f65da794.
Not classified: non-prose-or-short.
Readable text: other
other
scalar · byte 276191
Source: desktop/Cursor.app/Contents/Resources/app/extensions/cursor-agent-worker/dist/main.js, bytes 276191–276199, SHA-256 1cf2462dbf783967.
Not classified: non-prose-or-short.
Readable text: scalar
scalar
status · byte 276210
Source: desktop/Cursor.app/Contents/Resources/app/extensions/cursor-agent-worker/dist/main.js, bytes 276210–276218, SHA-256 cfc31bcc34ed7f4c.
Not classified: non-prose-or-short.
Readable text: status
status
anyrun.v1.ProgressDetail
Source: desktop/Cursor.app/Contents/Resources/app/extensions/cursor-agent-worker/dist/main.js, bytes 276244–276270, SHA-256 d777a02f5f26359d.
Not classified: non-prose-or-short.
Readable text: anyrun.v1.ProgressDetail
anyrun.v1.ProgressDetail
current
Source: desktop/Cursor.app/Contents/Resources/app/extensions/cursor-agent-worker/dist/main.js, bytes 276287–276296, SHA-256 694df57a7909d9f9.
Not classified: non-prose-or-short.
Readable text: current
current
scalar · byte 276302
Source: desktop/Cursor.app/Contents/Resources/app/extensions/cursor-agent-worker/dist/main.js, bytes 276302–276310, SHA-256 1cf2462dbf783967.
Not classified: non-prose-or-short.
Readable text: scalar
scalar
total · byte 276327
Source: desktop/Cursor.app/Contents/Resources/app/extensions/cursor-agent-worker/dist/main.js, bytes 276327–276334, SHA-256 714bdb4ba7da01e5.
Not classified: non-prose-or-short.
Readable text: total
total
scalar · byte 276340
Source: desktop/Cursor.app/Contents/Resources/app/extensions/cursor-agent-worker/dist/main.js, bytes 276340–276348, SHA-256 1cf2462dbf783967.
Not classified: non-prose-or-short.
Readable text: scalar
scalar
anyrun.v1.ImagePullStatusUpdate
Source: desktop/Cursor.app/Contents/Resources/app/extensions/cursor-agent-worker/dist/main.js, bytes 276378–276411, SHA-256 7a80fc13ca583043.
Not classified: non-prose-or-short.
Readable text: anyrun.v1.ImagePullStatusUpdate
anyrun.v1.ImagePullStatusUpdate
image name · byte 276428
Source: desktop/Cursor.app/Contents/Resources/app/extensions/cursor-agent-worker/dist/main.js, bytes 276428–276440, SHA-256 be2fd74ab26d082c.
Not classified: non-prose-or-short.
Readable text: image_name
image_name
scalar · byte 276446
Source: desktop/Cursor.app/Contents/Resources/app/extensions/cursor-agent-worker/dist/main.js, bytes 276446–276454, SHA-256 1cf2462dbf783967.
Not classified: non-prose-or-short.
Readable text: scalar
scalar
pull id · byte 276471
Source: desktop/Cursor.app/Contents/Resources/app/extensions/cursor-agent-worker/dist/main.js, bytes 276471–276480, SHA-256 945c37c27ff26682.
Not classified: non-prose-or-short.
Readable text: pull_id
pull_id
scalar · byte 276486
Source: desktop/Cursor.app/Contents/Resources/app/extensions/cursor-agent-worker/dist/main.js, bytes 276486–276494, SHA-256 1cf2462dbf783967.
Not classified: non-prose-or-short.
Readable text: scalar
scalar
status · byte 276511
Source: desktop/Cursor.app/Contents/Resources/app/extensions/cursor-agent-worker/dist/main.js, bytes 276511–276519, SHA-256 cfc31bcc34ed7f4c.
Not classified: non-prose-or-short.
Readable text: status
status
scalar · byte 276525
Source: desktop/Cursor.app/Contents/Resources/app/extensions/cursor-agent-worker/dist/main.js, bytes 276525–276533, SHA-256 1cf2462dbf783967.
Not classified: non-prose-or-short.
Readable text: scalar
scalar
anyrun.v1.ImagePullCompleted
Source: desktop/Cursor.app/Contents/Resources/app/extensions/cursor-agent-worker/dist/main.js, bytes 276563–276593, SHA-256 575b6f12d298d8ea.
Not classified: non-prose-or-short.
Readable text: anyrun.v1.ImagePullCompleted
anyrun.v1.ImagePullCompleted
image name · byte 276610
Source: desktop/Cursor.app/Contents/Resources/app/extensions/cursor-agent-worker/dist/main.js, bytes 276610–276622, SHA-256 be2fd74ab26d082c.
Not classified: non-prose-or-short.
Readable text: image_name
image_name
scalar · byte 276628
Source: desktop/Cursor.app/Contents/Resources/app/extensions/cursor-agent-worker/dist/main.js, bytes 276628–276636, SHA-256 1cf2462dbf783967.
Not classified: non-prose-or-short.
Readable text: scalar
scalar
pull id · byte 276653
Source: desktop/Cursor.app/Contents/Resources/app/extensions/cursor-agent-worker/dist/main.js, bytes 276653–276662, SHA-256 945c37c27ff26682.
Not classified: non-prose-or-short.
Readable text: pull_id
pull_id
scalar · byte 276668
Source: desktop/Cursor.app/Contents/Resources/app/extensions/cursor-agent-worker/dist/main.js, bytes 276668–276676, SHA-256 1cf2462dbf783967.
Not classified: non-prose-or-short.
Readable text: scalar
scalar
anyrun.v1.InstallCommand
Source: desktop/Cursor.app/Contents/Resources/app/extensions/cursor-agent-worker/dist/main.js, bytes 276706–276732, SHA-256 c715930302d0a5fb.
Not classified: non-prose-or-short.
Readable text: anyrun.v1.InstallCommand
anyrun.v1.InstallCommand
name · byte 276749
Source: desktop/Cursor.app/Contents/Resources/app/extensions/cursor-agent-worker/dist/main.js, bytes 276749–276755, SHA-256 6ffe58b85cad95f1.
Not classified: non-prose-or-short.
Readable text: name
name
scalar · byte 276761
Source: desktop/Cursor.app/Contents/Resources/app/extensions/cursor-agent-worker/dist/main.js, bytes 276761–276769, SHA-256 1cf2462dbf783967.
Not classified: non-prose-or-short.
Readable text: scalar
scalar
command · byte 276786
Source: desktop/Cursor.app/Contents/Resources/app/extensions/cursor-agent-worker/dist/main.js, bytes 276786–276795, SHA-256 015216f42e276406.
Not classified: non-prose-or-short.
Readable text: command
command
scalar · byte 276801
Source: desktop/Cursor.app/Contents/Resources/app/extensions/cursor-agent-worker/dist/main.js, bytes 276801–276809, SHA-256 1cf2462dbf783967.
Not classified: non-prose-or-short.
Readable text: scalar
scalar
user
Source: desktop/Cursor.app/Contents/Resources/app/extensions/cursor-agent-worker/dist/main.js, bytes 276826–276832, SHA-256 3190d261d186aeea.
Not classified: non-prose-or-short.
Readable text: user
user
scalar · byte 276838
Source: desktop/Cursor.app/Contents/Resources/app/extensions/cursor-agent-worker/dist/main.js, bytes 276838–276846, SHA-256 1cf2462dbf783967.
Not classified: non-prose-or-short.
Readable text: scalar
scalar
is system
Source: desktop/Cursor.app/Contents/Resources/app/extensions/cursor-agent-worker/dist/main.js, bytes 276870–276881, SHA-256 e32a1d19ed559999.
Not classified: non-prose-or-short.
Readable text: is_system
is_system
scalar · byte 276887
Source: desktop/Cursor.app/Contents/Resources/app/extensions/cursor-agent-worker/dist/main.js, bytes 276887–276895, SHA-256 1cf2462dbf783967.
Not classified: non-prose-or-short.
Readable text: scalar
scalar
failure tolerant
Source: desktop/Cursor.app/Contents/Resources/app/extensions/cursor-agent-worker/dist/main.js, bytes 276912–276930, SHA-256 707339efe7cf0852.
Not classified: non-prose-or-short.
Readable text: failure_tolerant
failure_tolerant
scalar · byte 276936
Source: desktop/Cursor.app/Contents/Resources/app/extensions/cursor-agent-worker/dist/main.js, bytes 276936–276944, SHA-256 1cf2462dbf783967.
Not classified: non-prose-or-short.
Readable text: scalar
scalar
anyrun.v1.CloneStarted
Source: desktop/Cursor.app/Contents/Resources/app/extensions/cursor-agent-worker/dist/main.js, bytes 276974–276998, SHA-256 df9f5293b04d5e12.
Not classified: non-prose-or-short.
Readable text: anyrun.v1.CloneStarted
anyrun.v1.CloneStarted
purpose
Source: desktop/Cursor.app/Contents/Resources/app/extensions/cursor-agent-worker/dist/main.js, bytes 277015–277024, SHA-256 bf013612f82a8be0.
Not classified: non-prose-or-short.
Readable text: purpose
purpose
enum · byte 277030
Source: desktop/Cursor.app/Contents/Resources/app/extensions/cursor-agent-worker/dist/main.js, bytes 277030–277036, SHA-256 e49fb5f753e8aa4d.
Not classified: non-prose-or-short.
Readable text: enum
enum
anyrun.v1.CloneCompleted
Source: desktop/Cursor.app/Contents/Resources/app/extensions/cursor-agent-worker/dist/main.js, bytes 277083–277109, SHA-256 dee633e6b81db041.
Not classified: non-prose-or-short.
Readable text: anyrun.v1.CloneCompleted
anyrun.v1.CloneCompleted
purpose · byte 277126
Source: desktop/Cursor.app/Contents/Resources/app/extensions/cursor-agent-worker/dist/main.js, bytes 277126–277135, SHA-256 bf013612f82a8be0.
Not classified: non-prose-or-short.
Readable text: purpose
purpose
enum · byte 277141
Source: desktop/Cursor.app/Contents/Resources/app/extensions/cursor-agent-worker/dist/main.js, bytes 277141–277147, SHA-256 e49fb5f753e8aa4d.
Not classified: non-prose-or-short.
Readable text: enum
enum
anyrun.v1.WorkspaceGitSetupMode
Source: desktop/Cursor.app/Contents/Resources/app/extensions/cursor-agent-worker/dist/main.js, bytes 277187–277220, SHA-256 e7a8874094209bdc.
Not classified: non-prose-or-short.
Readable text: anyrun.v1.WorkspaceGitSetupMode
anyrun.v1.WorkspaceGitSetupMode
WORKSPACE GIT SETUP MODE UNSPECIFIED
Source: desktop/Cursor.app/Contents/Resources/app/extensions/cursor-agent-worker/dist/main.js, bytes 277233–277271, SHA-256 bc5b2ffb3700a100.
Not classified: non-prose-or-short.
Readable text: WORKSPACE_GIT_SETUP_MODE_UNSPECIFIED
WORKSPACE_GIT_SETUP_MODE_UNSPECIFIED
UNSPECIFIED
Source: desktop/Cursor.app/Contents/Resources/app/extensions/cursor-agent-worker/dist/main.js, bytes 277282–277295, SHA-256 540a50091e105303.
Not classified: non-prose-or-short.
Readable text: UNSPECIFIED
UNSPECIFIED
WORKSPACE GIT SETUP MODE REUSE
Source: desktop/Cursor.app/Contents/Resources/app/extensions/cursor-agent-worker/dist/main.js, bytes 277308–277340, SHA-256 81aee9023eab2dec.
Not classified: non-prose-or-short.
Readable text: WORKSPACE_GIT_SETUP_MODE_REUSE
WORKSPACE_GIT_SETUP_MODE_REUSE
REUSE
Source: desktop/Cursor.app/Contents/Resources/app/extensions/cursor-agent-worker/dist/main.js, bytes 277351–277358, SHA-256 89f546b79e4fd520.
Not classified: non-prose-or-short.
Readable text: REUSE
REUSE
WORKSPACE GIT SETUP MODE REUSE THEN CHECKOUT
Source: desktop/Cursor.app/Contents/Resources/app/extensions/cursor-agent-worker/dist/main.js, bytes 277371–277417, SHA-256 7834b056b8ef5502.
Not classified: non-prose-or-short.
Readable text: WORKSPACE_GIT_SETUP_MODE_REUSE_THEN_CHECKOUT
WORKSPACE_GIT_SETUP_MODE_REUSE_THEN_CHECKOUT
REUSE THEN CHECKOUT
Source: desktop/Cursor.app/Contents/Resources/app/extensions/cursor-agent-worker/dist/main.js, bytes 277428–277449, SHA-256 7ff49a59c22a589d.
Not classified: non-prose-or-short.
Readable text: REUSE_THEN_CHECKOUT
REUSE_THEN_CHECKOUT
WORKSPACE GIT SETUP MODE NO REPO
Source: desktop/Cursor.app/Contents/Resources/app/extensions/cursor-agent-worker/dist/main.js, bytes 277462–277496, SHA-256 de1f8e4cd17d2f0c.
Not classified: non-prose-or-short.
Readable text: WORKSPACE_GIT_SETUP_MODE_NO_REPO
WORKSPACE_GIT_SETUP_MODE_NO_REPO
NO REPO
Source: desktop/Cursor.app/Contents/Resources/app/extensions/cursor-agent-worker/dist/main.js, bytes 277507–277516, SHA-256 79c39645cbc225c5.
Not classified: non-prose-or-short.
Readable text: NO_REPO
NO_REPO
anyrun.v1.WarmForkMode
Source: desktop/Cursor.app/Contents/Resources/app/extensions/cursor-agent-worker/dist/main.js, bytes 277535–277559, SHA-256 318bc11ad1d680cd.
Not classified: non-prose-or-short.
Readable text: anyrun.v1.WarmForkMode
anyrun.v1.WarmForkMode
WARM FORK MODE UNSPECIFIED
Source: desktop/Cursor.app/Contents/Resources/app/extensions/cursor-agent-worker/dist/main.js, bytes 277572–277600, SHA-256 4249754024650f24.
Not classified: non-prose-or-short.
Readable text: WARM_FORK_MODE_UNSPECIFIED
WARM_FORK_MODE_UNSPECIFIED
UNSPECIFIED · byte 277611
Source: desktop/Cursor.app/Contents/Resources/app/extensions/cursor-agent-worker/dist/main.js, bytes 277611–277624, SHA-256 540a50091e105303.
Not classified: non-prose-or-short.
Readable text: UNSPECIFIED
UNSPECIFIED
WARM FORK MODE NONE
Source: desktop/Cursor.app/Contents/Resources/app/extensions/cursor-agent-worker/dist/main.js, bytes 277637–277658, SHA-256 96d284e02649f71b.
Not classified: non-prose-or-short.
Readable text: WARM_FORK_MODE_NONE
WARM_FORK_MODE_NONE
NONE
Source: desktop/Cursor.app/Contents/Resources/app/extensions/cursor-agent-worker/dist/main.js, bytes 277669–277675, SHA-256 c44e6dd700593104.
Not classified: non-prose-or-short.
Readable text: NONE
NONE
WARM FORK MODE FORKED
Source: desktop/Cursor.app/Contents/Resources/app/extensions/cursor-agent-worker/dist/main.js, bytes 277688–277711, SHA-256 4e59a5738bc1b1a6.
Not classified: non-prose-or-short.
Readable text: WARM_FORK_MODE_FORKED
WARM_FORK_MODE_FORKED
FORKED
Source: desktop/Cursor.app/Contents/Resources/app/extensions/cursor-agent-worker/dist/main.js, bytes 277722–277730, SHA-256 7bbbec5987c84e0f.
Not classified: non-prose-or-short.
Readable text: FORKED
FORKED
WARM FORK MODE COLD FALLBACK
Source: desktop/Cursor.app/Contents/Resources/app/extensions/cursor-agent-worker/dist/main.js, bytes 277743–277773, SHA-256 d2e695e4298b1b7a.
Not classified: non-prose-or-short.
Readable text: WARM_FORK_MODE_COLD_FALLBACK
WARM_FORK_MODE_COLD_FALLBACK
COLD FALLBACK
Source: desktop/Cursor.app/Contents/Resources/app/extensions/cursor-agent-worker/dist/main.js, bytes 277784–277799, SHA-256 7bafcf7e7241b724.
Not classified: non-prose-or-short.
Readable text: COLD_FALLBACK
COLD_FALLBACK
WARM FORK MODE LAZY LOAD
Source: desktop/Cursor.app/Contents/Resources/app/extensions/cursor-agent-worker/dist/main.js, bytes 277812–277838, SHA-256 6c918746abf03704.
Not classified: non-prose-or-short.
Readable text: WARM_FORK_MODE_LAZY_LOAD
WARM_FORK_MODE_LAZY_LOAD
LAZY LOAD
Source: desktop/Cursor.app/Contents/Resources/app/extensions/cursor-agent-worker/dist/main.js, bytes 277849–277860, SHA-256 1195c235280811fc.
Not classified: non-prose-or-short.
Readable text: LAZY_LOAD
LAZY_LOAD
WARM FORK MODE COLD FALLBACK LAZY LOAD
Source: desktop/Cursor.app/Contents/Resources/app/extensions/cursor-agent-worker/dist/main.js, bytes 277873–277913, SHA-256 54d5b5d7bd177a5a.
Not classified: non-prose-or-short.
Readable text: WARM_FORK_MODE_COLD_FALLBACK_LAZY_LOAD
WARM_FORK_MODE_COLD_FALLBACK_LAZY_LOAD
COLD FALLBACK LAZY LOAD
Source: desktop/Cursor.app/Contents/Resources/app/extensions/cursor-agent-worker/dist/main.js, bytes 277924–277949, SHA-256 f84e2c08321c28de.
Not classified: non-prose-or-short.
Readable text: COLD_FALLBACK_LAZY_LOAD
COLD_FALLBACK_LAZY_LOAD
anyrun.v1.EnvironmentBuildResolution
Source: desktop/Cursor.app/Contents/Resources/app/extensions/cursor-agent-worker/dist/main.js, bytes 277968–278006, SHA-256 de6369c4899a0f49.
Not classified: non-prose-or-short.
Readable text: anyrun.v1.EnvironmentBuildResolution
anyrun.v1.EnvironmentBuildResolution
ENVIRONMENT BUILD RESOLUTION UNSPECIFIED
Source: desktop/Cursor.app/Contents/Resources/app/extensions/cursor-agent-worker/dist/main.js, bytes 278019–278061, SHA-256 08d71cd8129cdd54.
Not classified: non-prose-or-short.
Readable text: ENVIRONMENT_BUILD_RESOLUTION_UNSPECIFIED
ENVIRONMENT_BUILD_RESOLUTION_UNSPECIFIED
UNSPECIFIED · byte 278072
Source: desktop/Cursor.app/Contents/Resources/app/extensions/cursor-agent-worker/dist/main.js, bytes 278072–278085, SHA-256 540a50091e105303.
Not classified: non-prose-or-short.
Readable text: UNSPECIFIED
UNSPECIFIED
ENVIRONMENT BUILD RESOLUTION RESOLVED
Source: desktop/Cursor.app/Contents/Resources/app/extensions/cursor-agent-worker/dist/main.js, bytes 278098–278137, SHA-256 da2f888ace6aaa16.
Not classified: non-prose-or-short.
Readable text: ENVIRONMENT_BUILD_RESOLUTION_RESOLVED
ENVIRONMENT_BUILD_RESOLUTION_RESOLVED
RESOLVED
Source: desktop/Cursor.app/Contents/Resources/app/extensions/cursor-agent-worker/dist/main.js, bytes 278148–278158, SHA-256 606bfec62d65160a.
Not classified: non-prose-or-short.
Readable text: RESOLVED
RESOLVED
ENVIRONMENT BUILD RESOLUTION NO FINISHED BUILDS
Source: desktop/Cursor.app/Contents/Resources/app/extensions/cursor-agent-worker/dist/main.js, bytes 278171–278220, SHA-256 beeadd9dd1d962cb.
Not classified: non-prose-or-short.
Readable text: ENVIRONMENT_BUILD_RESOLUTION_NO_FINISHED_BUILDS
ENVIRONMENT_BUILD_RESOLUTION_NO_FINISHED_BUILDS
NO FINISHED BUILDS
Source: desktop/Cursor.app/Contents/Resources/app/extensions/cursor-agent-worker/dist/main.js, bytes 278231–278251, SHA-256 256d3a8312102604.
Not classified: non-prose-or-short.
Readable text: NO_FINISHED_BUILDS
NO_FINISHED_BUILDS
ENVIRONMENT BUILD RESOLUTION NO HEALTHY BUILDS
Source: desktop/Cursor.app/Contents/Resources/app/extensions/cursor-agent-worker/dist/main.js, bytes 278264–278312, SHA-256 6c7a1dc889858529.
Not classified: non-prose-or-short.
Readable text: ENVIRONMENT_BUILD_RESOLUTION_NO_HEALTHY_BUILDS
ENVIRONMENT_BUILD_RESOLUTION_NO_HEALTHY_BUILDS
NO HEALTHY BUILDS
Source: desktop/Cursor.app/Contents/Resources/app/extensions/cursor-agent-worker/dist/main.js, bytes 278323–278342, SHA-256 507a89b777473697.
Not classified: non-prose-or-short.
Readable text: NO_HEALTHY_BUILDS
NO_HEALTHY_BUILDS
anyrun.v1.EnvironmentBuildBootInfo
Source: desktop/Cursor.app/Contents/Resources/app/extensions/cursor-agent-worker/dist/main.js, bytes 278368–278404, SHA-256 16b650bf2981d976.
Not classified: non-prose-or-short.
Readable text: anyrun.v1.EnvironmentBuildBootInfo
anyrun.v1.EnvironmentBuildBootInfo
build id
Source: desktop/Cursor.app/Contents/Resources/app/extensions/cursor-agent-worker/dist/main.js, bytes 278421–278431, SHA-256 dfc01ff5df1cf25b.
Not classified: non-prose-or-short.
Readable text: build_id
build_id
scalar · byte 278437
Source: desktop/Cursor.app/Contents/Resources/app/extensions/cursor-agent-worker/dist/main.js, bytes 278437–278445, SHA-256 1cf2462dbf783967.
Not classified: non-prose-or-short.
Readable text: scalar
scalar
snapshot id
Source: desktop/Cursor.app/Contents/Resources/app/extensions/cursor-agent-worker/dist/main.js, bytes 278469–278482, SHA-256 c2b1ea8b8f4a7493.
Not classified: non-prose-or-short.
Readable text: snapshot_id
snapshot_id
scalar · byte 278488
Source: desktop/Cursor.app/Contents/Resources/app/extensions/cursor-agent-worker/dist/main.js, bytes 278488–278496, SHA-256 1cf2462dbf783967.
Not classified: non-prose-or-short.
Readable text: scalar
scalar
workspace git setup mode
Source: desktop/Cursor.app/Contents/Resources/app/extensions/cursor-agent-worker/dist/main.js, bytes 278513–278539, SHA-256 f68efa7bbd9aa3b4.
Not classified: non-prose-or-short.
Readable text: workspace_git_setup_mode
workspace_git_setup_mode
enum · byte 278545
Source: desktop/Cursor.app/Contents/Resources/app/extensions/cursor-agent-worker/dist/main.js, bytes 278545–278551, SHA-256 e49fb5f753e8aa4d.
Not classified: non-prose-or-short.
Readable text: enum
enum
warm fork mode
Source: desktop/Cursor.app/Contents/Resources/app/extensions/cursor-agent-worker/dist/main.js, bytes 278585–278601, SHA-256 402403ddffbe2018.
Not classified: non-prose-or-short.
Readable text: warm_fork_mode
warm_fork_mode
enum · byte 278607
Source: desktop/Cursor.app/Contents/Resources/app/extensions/cursor-agent-worker/dist/main.js, bytes 278607–278613, SHA-256 e49fb5f753e8aa4d.
Not classified: non-prose-or-short.
Readable text: enum
enum
fast forward default branch
Source: desktop/Cursor.app/Contents/Resources/app/extensions/cursor-agent-worker/dist/main.js, bytes 278647–278676, SHA-256 22c5bb0d45a8d7fc.
Not classified: non-prose-or-short.
Readable text: fast_forward_default_branch
fast_forward_default_branch
scalar · byte 278682
Source: desktop/Cursor.app/Contents/Resources/app/extensions/cursor-agent-worker/dist/main.js, bytes 278682–278690, SHA-256 1cf2462dbf783967.
Not classified: non-prose-or-short.
Readable text: scalar
scalar
resolution
Source: desktop/Cursor.app/Contents/Resources/app/extensions/cursor-agent-worker/dist/main.js, bytes 278707–278719, SHA-256 908470c2a2c1feb4.
Not classified: non-prose-or-short.
Readable text: resolution
resolution
enum · byte 278725
Source: desktop/Cursor.app/Contents/Resources/app/extensions/cursor-agent-worker/dist/main.js, bytes 278725–278731, SHA-256 e49fb5f753e8aa4d.
Not classified: non-prose-or-short.
Readable text: enum
enum
default image fallback
Source: desktop/Cursor.app/Contents/Resources/app/extensions/cursor-agent-worker/dist/main.js, bytes 278765–278789, SHA-256 e10f1fb3cd2d7d2e.
Not classified: non-prose-or-short.
Readable text: default_image_fallback
default_image_fallback
scalar · byte 278795
Source: desktop/Cursor.app/Contents/Resources/app/extensions/cursor-agent-worker/dist/main.js, bytes 278795–278803, SHA-256 1cf2462dbf783967.
Not classified: non-prose-or-short.
Readable text: scalar
scalar
anyrun.v1.PodCreatingPhase
Source: desktop/Cursor.app/Contents/Resources/app/extensions/cursor-agent-worker/dist/main.js, bytes 278826–278854, SHA-256 01ca7d318502c100.
Not classified: non-prose-or-short.
Readable text: anyrun.v1.PodCreatingPhase
anyrun.v1.PodCreatingPhase
POD CREATING PHASE UNSPECIFIED
Source: desktop/Cursor.app/Contents/Resources/app/extensions/cursor-agent-worker/dist/main.js, bytes 278867–278899, SHA-256 ad7f42a07be81539.
Not classified: non-prose-or-short.
Readable text: POD_CREATING_PHASE_UNSPECIFIED
POD_CREATING_PHASE_UNSPECIFIED
UNSPECIFIED · byte 278910
Source: desktop/Cursor.app/Contents/Resources/app/extensions/cursor-agent-worker/dist/main.js, bytes 278910–278923, SHA-256 540a50091e105303.
Not classified: non-prose-or-short.
Readable text: UNSPECIFIED
UNSPECIFIED
POD CREATING PHASE CLONE
Source: desktop/Cursor.app/Contents/Resources/app/extensions/cursor-agent-worker/dist/main.js, bytes 278936–278962, SHA-256 a333b6b3a36f9afa.
Not classified: non-prose-or-short.
Readable text: POD_CREATING_PHASE_CLONE
POD_CREATING_PHASE_CLONE
CLONE
Source: desktop/Cursor.app/Contents/Resources/app/extensions/cursor-agent-worker/dist/main.js, bytes 278973–278980, SHA-256 a7cd1c16a376c13d.
Not classified: non-prose-or-short.
Readable text: CLONE
CLONE
POD CREATING PHASE BUILD
Source: desktop/Cursor.app/Contents/Resources/app/extensions/cursor-agent-worker/dist/main.js, bytes 278993–279019, SHA-256 55526e69fe2e4fef.
Not classified: non-prose-or-short.
Readable text: POD_CREATING_PHASE_BUILD
POD_CREATING_PHASE_BUILD
BUILD
Source: desktop/Cursor.app/Contents/Resources/app/extensions/cursor-agent-worker/dist/main.js, bytes 279030–279037, SHA-256 5f6c2a1b54cf56ee.
Not classified: non-prose-or-short.
Readable text: BUILD
BUILD
POD CREATING PHASE POST CREATE
Source: desktop/Cursor.app/Contents/Resources/app/extensions/cursor-agent-worker/dist/main.js, bytes 279050–279082, SHA-256 f8d5f72fbb7a447c.
Not classified: non-prose-or-short.
Readable text: POD_CREATING_PHASE_POST_CREATE
POD_CREATING_PHASE_POST_CREATE
POST CREATE
Source: desktop/Cursor.app/Contents/Resources/app/extensions/cursor-agent-worker/dist/main.js, bytes 279093–279106, SHA-256 ccc879195aa90a2b.
Not classified: non-prose-or-short.
Readable text: POST_CREATE
POST_CREATE
POD CREATING PHASE UPDATE CONTENT
Source: desktop/Cursor.app/Contents/Resources/app/extensions/cursor-agent-worker/dist/main.js, bytes 279119–279154, SHA-256 39822f584d8ee101.
Not classified: non-prose-or-short.
Readable text: POD_CREATING_PHASE_UPDATE_CONTENT
POD_CREATING_PHASE_UPDATE_CONTENT
UPDATE CONTENT
Source: desktop/Cursor.app/Contents/Resources/app/extensions/cursor-agent-worker/dist/main.js, bytes 279165–279181, SHA-256 38e01a18122d7bb7.
Not classified: non-prose-or-short.
Readable text: UPDATE_CONTENT
UPDATE_CONTENT
POD CREATING PHASE POST START
Source: desktop/Cursor.app/Contents/Resources/app/extensions/cursor-agent-worker/dist/main.js, bytes 279194–279225, SHA-256 cb01623763697459.
Not classified: non-prose-or-short.
Readable text: POD_CREATING_PHASE_POST_START
POD_CREATING_PHASE_POST_START
POST START
Source: desktop/Cursor.app/Contents/Resources/app/extensions/cursor-agent-worker/dist/main.js, bytes 279236–279248, SHA-256 aeee2096807309fc.
Not classified: non-prose-or-short.
Readable text: POST_START
POST_START
POD CREATING PHASE QUEUED
Source: desktop/Cursor.app/Contents/Resources/app/extensions/cursor-agent-worker/dist/main.js, bytes 279261–279288, SHA-256 880aba2d53237792.
Not classified: non-prose-or-short.
Readable text: POD_CREATING_PHASE_QUEUED
POD_CREATING_PHASE_QUEUED
QUEUED
Source: desktop/Cursor.app/Contents/Resources/app/extensions/cursor-agent-worker/dist/main.js, bytes 279299–279307, SHA-256 640983b8e300f87b.
Not classified: non-prose-or-short.
Readable text: QUEUED
QUEUED
anyrun.v1.ImagePullFailureCategory
Source: desktop/Cursor.app/Contents/Resources/app/extensions/cursor-agent-worker/dist/main.js, bytes 279326–279362, SHA-256 772e903af9489d88.
Not classified: non-prose-or-short.
Readable text: anyrun.v1.ImagePullFailureCategory
anyrun.v1.ImagePullFailureCategory
IMAGE PULL FAILURE CATEGORY UNSPECIFIED
Source: desktop/Cursor.app/Contents/Resources/app/extensions/cursor-agent-worker/dist/main.js, bytes 279375–279416, SHA-256 a144b229e0a88cde.
Not classified: non-prose-or-short.
Readable text: IMAGE_PULL_FAILURE_CATEGORY_UNSPECIFIED
IMAGE_PULL_FAILURE_CATEGORY_UNSPECIFIED
UNSPECIFIED · byte 279427
Source: desktop/Cursor.app/Contents/Resources/app/extensions/cursor-agent-worker/dist/main.js, bytes 279427–279440, SHA-256 540a50091e105303.
Not classified: non-prose-or-short.
Readable text: UNSPECIFIED
UNSPECIFIED
IMAGE PULL FAILURE CATEGORY DENIED
Source: desktop/Cursor.app/Contents/Resources/app/extensions/cursor-agent-worker/dist/main.js, bytes 279453–279489, SHA-256 d25c16e5734b60dd.
Not classified: non-prose-or-short.
Readable text: IMAGE_PULL_FAILURE_CATEGORY_DENIED
IMAGE_PULL_FAILURE_CATEGORY_DENIED
DENIED
Source: desktop/Cursor.app/Contents/Resources/app/extensions/cursor-agent-worker/dist/main.js, bytes 279500–279508, SHA-256 6589229a3667fd03.
Not classified: non-prose-or-short.
Readable text: DENIED
DENIED
IMAGE PULL FAILURE CATEGORY UNAUTHORIZED
Source: desktop/Cursor.app/Contents/Resources/app/extensions/cursor-agent-worker/dist/main.js, bytes 279521–279563, SHA-256 a729cf0f6e4d9073.
Not classified: non-prose-or-short.
Readable text: IMAGE_PULL_FAILURE_CATEGORY_UNAUTHORIZED
IMAGE_PULL_FAILURE_CATEGORY_UNAUTHORIZED
UNAUTHORIZED
Source: desktop/Cursor.app/Contents/Resources/app/extensions/cursor-agent-worker/dist/main.js, bytes 279574–279588, SHA-256 7c012e354d9062b8.
Not classified: non-prose-or-short.
Readable text: UNAUTHORIZED
UNAUTHORIZED
IMAGE PULL FAILURE CATEGORY NOT FOUND
Source: desktop/Cursor.app/Contents/Resources/app/extensions/cursor-agent-worker/dist/main.js, bytes 279601–279640, SHA-256 9fb59f48aafb3b90.
Not classified: non-prose-or-short.
Readable text: IMAGE_PULL_FAILURE_CATEGORY_NOT_FOUND
IMAGE_PULL_FAILURE_CATEGORY_NOT_FOUND
NOT FOUND
Source: desktop/Cursor.app/Contents/Resources/app/extensions/cursor-agent-worker/dist/main.js, bytes 279651–279662, SHA-256 6abf1008d3503e3b.
Not classified: non-prose-or-short.
Readable text: NOT_FOUND
NOT_FOUND
IMAGE PULL FAILURE CATEGORY RATE LIMITED
Source: desktop/Cursor.app/Contents/Resources/app/extensions/cursor-agent-worker/dist/main.js, bytes 279675–279717, SHA-256 29c4ab3ca7022e22.
Not classified: non-prose-or-short.
Readable text: IMAGE_PULL_FAILURE_CATEGORY_RATE_LIMITED
IMAGE_PULL_FAILURE_CATEGORY_RATE_LIMITED
RATE LIMITED
Source: desktop/Cursor.app/Contents/Resources/app/extensions/cursor-agent-worker/dist/main.js, bytes 279728–279742, SHA-256 bf0d0d8b58717091.
Not classified: non-prose-or-short.
Readable text: RATE_LIMITED
RATE_LIMITED
IMAGE PULL FAILURE CATEGORY UPSTREAM
Source: desktop/Cursor.app/Contents/Resources/app/extensions/cursor-agent-worker/dist/main.js, bytes 279755–279793, SHA-256 30391e199b37491a.
Not classified: non-prose-or-short.
Readable text: IMAGE_PULL_FAILURE_CATEGORY_UPSTREAM
IMAGE_PULL_FAILURE_CATEGORY_UPSTREAM
UPSTREAM
Source: desktop/Cursor.app/Contents/Resources/app/extensions/cursor-agent-worker/dist/main.js, bytes 279804–279814, SHA-256 15eb437b3b7706ca.
Not classified: non-prose-or-short.
Readable text: UPSTREAM
UPSTREAM
anyrun.v1.PodStatus
Source: desktop/Cursor.app/Contents/Resources/app/extensions/cursor-agent-worker/dist/main.js, bytes 279840–279861, SHA-256 aaec2b19e1fde7fc.
Not classified: non-prose-or-short.
Readable text: anyrun.v1.PodStatus
anyrun.v1.PodStatus
creating
Source: desktop/Cursor.app/Contents/Resources/app/extensions/cursor-agent-worker/dist/main.js, bytes 279878–279888, SHA-256 572ff8de4f35d119.
Not classified: non-prose-or-short.
Readable text: creating
creating
message · byte 279894
Source: desktop/Cursor.app/Contents/Resources/app/extensions/cursor-agent-worker/dist/main.js, bytes 279894–279903, SHA-256 fd3830a0864dd9df.
Not classified: non-prose-or-short.
Readable text: message
message
status · byte 279915
Source: desktop/Cursor.app/Contents/Resources/app/extensions/cursor-agent-worker/dist/main.js, bytes 279915–279923, SHA-256 cfc31bcc34ed7f4c.
Not classified: non-prose-or-short.
Readable text: status
status
running
Source: desktop/Cursor.app/Contents/Resources/app/extensions/cursor-agent-worker/dist/main.js, bytes 279936–279945, SHA-256 79d116a0c160c527.
Not classified: non-prose-or-short.
Readable text: running
running
message · byte 279951
Source: desktop/Cursor.app/Contents/Resources/app/extensions/cursor-agent-worker/dist/main.js, bytes 279951–279960, SHA-256 fd3830a0864dd9df.
Not classified: non-prose-or-short.
Readable text: message
message
status · byte 279972
Source: desktop/Cursor.app/Contents/Resources/app/extensions/cursor-agent-worker/dist/main.js, bytes 279972–279980, SHA-256 cfc31bcc34ed7f4c.
Not classified: non-prose-or-short.
Readable text: status
status
failed
Source: desktop/Cursor.app/Contents/Resources/app/extensions/cursor-agent-worker/dist/main.js, bytes 279993–280001, SHA-256 33d04bd775e7b6c6.
Not classified: non-prose-or-short.
Readable text: failed
failed
message · byte 280007
Source: desktop/Cursor.app/Contents/Resources/app/extensions/cursor-agent-worker/dist/main.js, bytes 280007–280016, SHA-256 fd3830a0864dd9df.
Not classified: non-prose-or-short.
Readable text: message
message
status · byte 280028
Source: desktop/Cursor.app/Contents/Resources/app/extensions/cursor-agent-worker/dist/main.js, bytes 280028–280036, SHA-256 cfc31bcc34ed7f4c.
Not classified: non-prose-or-short.
Readable text: status
status
terminated
Source: desktop/Cursor.app/Contents/Resources/app/extensions/cursor-agent-worker/dist/main.js, bytes 280049–280061, SHA-256 1855e0f8a4e6f2ac.
Not classified: non-prose-or-short.
Readable text: terminated
terminated
message · byte 280067
Source: desktop/Cursor.app/Contents/Resources/app/extensions/cursor-agent-worker/dist/main.js, bytes 280067–280076, SHA-256 fd3830a0864dd9df.
Not classified: non-prose-or-short.
Readable text: message
message
status · byte 280088
Source: desktop/Cursor.app/Contents/Resources/app/extensions/cursor-agent-worker/dist/main.js, bytes 280088–280096, SHA-256 cfc31bcc34ed7f4c.
Not classified: non-prose-or-short.
Readable text: status
status
anyrun.v1.PodCreatingStatus
Source: desktop/Cursor.app/Contents/Resources/app/extensions/cursor-agent-worker/dist/main.js, bytes 280122–280151, SHA-256 6f4baa67552e9def.
Not classified: non-prose-or-short.
Readable text: anyrun.v1.PodCreatingStatus
anyrun.v1.PodCreatingStatus
phase
Source: desktop/Cursor.app/Contents/Resources/app/extensions/cursor-agent-worker/dist/main.js, bytes 280168–280175, SHA-256 a28370790538acea.
Not classified: non-prose-or-short.
Readable text: phase
phase
enum · byte 280181
Source: desktop/Cursor.app/Contents/Resources/app/extensions/cursor-agent-worker/dist/main.js, bytes 280181–280187, SHA-256 e49fb5f753e8aa4d.
Not classified: non-prose-or-short.
Readable text: enum
enum
anyrun.v1.PodRunningStatus
Source: desktop/Cursor.app/Contents/Resources/app/extensions/cursor-agent-worker/dist/main.js, bytes 280234–280262, SHA-256 72b37953bf4c0ca9.
Not classified: non-prose-or-short.
Readable text: anyrun.v1.PodRunningStatus
anyrun.v1.PodRunningStatus
missed heartbeat deadline
Source: desktop/Cursor.app/Contents/Resources/app/extensions/cursor-agent-worker/dist/main.js, bytes 280279–280306, SHA-256 9481b2bd42f4449b.
Not classified: non-prose-or-short.
Readable text: missed_heartbeat_deadline
missed_heartbeat_deadline
scalar · byte 280312
Source: desktop/Cursor.app/Contents/Resources/app/extensions/cursor-agent-worker/dist/main.js, bytes 280312–280320, SHA-256 1cf2462dbf783967.
Not classified: non-prose-or-short.
Readable text: scalar
scalar
anyrun.v1.PodFailedStatus
Source: desktop/Cursor.app/Contents/Resources/app/extensions/cursor-agent-worker/dist/main.js, bytes 280357–280384, SHA-256 e93ca7c58e6f4bc4.
Not classified: non-prose-or-short.
Readable text: anyrun.v1.PodFailedStatus
anyrun.v1.PodFailedStatus
reason · byte 280401
Source: desktop/Cursor.app/Contents/Resources/app/extensions/cursor-agent-worker/dist/main.js, bytes 280401–280409, SHA-256 5c92521b872208bb.
Not classified: non-prose-or-short.
Readable text: reason
reason
scalar · byte 280415
Source: desktop/Cursor.app/Contents/Resources/app/extensions/cursor-agent-worker/dist/main.js, bytes 280415–280423, SHA-256 1cf2462dbf783967.
Not classified: non-prose-or-short.
Readable text: scalar
scalar
failure details
Source: desktop/Cursor.app/Contents/Resources/app/extensions/cursor-agent-worker/dist/main.js, bytes 280440–280457, SHA-256 15bac6fd6206fcf9.
Not classified: non-prose-or-short.
Readable text: failure_details
failure_details
message · byte 280463
Source: desktop/Cursor.app/Contents/Resources/app/extensions/cursor-agent-worker/dist/main.js, bytes 280463–280472, SHA-256 fd3830a0864dd9df.
Not classified: non-prose-or-short.
Readable text: message
message
anyrun.v1.PodTerminatedStatus
Source: desktop/Cursor.app/Contents/Resources/app/extensions/cursor-agent-worker/dist/main.js, bytes 280510–280541, SHA-256 af0341f2a013e8a0.
Not classified: non-prose-or-short.
Readable text: anyrun.v1.PodTerminatedStatus
anyrun.v1.PodTerminatedStatus
reason · byte 280558
Source: desktop/Cursor.app/Contents/Resources/app/extensions/cursor-agent-worker/dist/main.js, bytes 280558–280566, SHA-256 5c92521b872208bb.
Not classified: non-prose-or-short.
Readable text: reason
reason
scalar · byte 280572
Source: desktop/Cursor.app/Contents/Resources/app/extensions/cursor-agent-worker/dist/main.js, bytes 280572–280580, SHA-256 1cf2462dbf783967.
Not classified: non-prose-or-short.
Readable text: scalar
scalar
exit code · byte 280597
Source: desktop/Cursor.app/Contents/Resources/app/extensions/cursor-agent-worker/dist/main.js, bytes 280597–280608, SHA-256 f3a2ff6c1c655209.
Not classified: non-prose-or-short.
Readable text: exit_code
exit_code
scalar · byte 280614
Source: desktop/Cursor.app/Contents/Resources/app/extensions/cursor-agent-worker/dist/main.js, bytes 280614–280622, SHA-256 1cf2462dbf783967.
Not classified: non-prose-or-short.
Readable text: scalar
scalar
anyrun.v1.PodFailureDetails
Source: desktop/Cursor.app/Contents/Resources/app/extensions/cursor-agent-worker/dist/main.js, bytes 280660–280689, SHA-256 c7a64cf8821e3c0f.
Not classified: non-prose-or-short.
Readable text: anyrun.v1.PodFailureDetails
anyrun.v1.PodFailureDetails
install command failure
Source: desktop/Cursor.app/Contents/Resources/app/extensions/cursor-agent-worker/dist/main.js, bytes 280706–280731, SHA-256 268c4ab0f8b333c3.
Not classified: non-prose-or-short.
Readable text: install_command_failure
install_command_failure
message · byte 280737
Source: desktop/Cursor.app/Contents/Resources/app/extensions/cursor-agent-worker/dist/main.js, bytes 280737–280746, SHA-256 fd3830a0864dd9df.
Not classified: non-prose-or-short.
Readable text: message
message
details
Source: desktop/Cursor.app/Contents/Resources/app/extensions/cursor-agent-worker/dist/main.js, bytes 280758–280767, SHA-256 521bcb5e201a81f3.
Not classified: non-prose-or-short.
Readable text: details
details
docker build failure
Source: desktop/Cursor.app/Contents/Resources/app/extensions/cursor-agent-worker/dist/main.js, bytes 280780–280802, SHA-256 3ad5aa52fd8ac739.
Not classified: non-prose-or-short.
Readable text: docker_build_failure
docker_build_failure
message · byte 280808
Source: desktop/Cursor.app/Contents/Resources/app/extensions/cursor-agent-worker/dist/main.js, bytes 280808–280817, SHA-256 fd3830a0864dd9df.
Not classified: non-prose-or-short.
Readable text: message
message
details · byte 280829
Source: desktop/Cursor.app/Contents/Resources/app/extensions/cursor-agent-worker/dist/main.js, bytes 280829–280838, SHA-256 521bcb5e201a81f3.
Not classified: non-prose-or-short.
Readable text: details
details
container wait failure
Source: desktop/Cursor.app/Contents/Resources/app/extensions/cursor-agent-worker/dist/main.js, bytes 280851–280875, SHA-256 8abd74c18e10c62a.
Not classified: non-prose-or-short.
Readable text: container_wait_failure
container_wait_failure
message · byte 280881
Source: desktop/Cursor.app/Contents/Resources/app/extensions/cursor-agent-worker/dist/main.js, bytes 280881–280890, SHA-256 fd3830a0864dd9df.
Not classified: non-prose-or-short.
Readable text: message
message
details · byte 280902
Source: desktop/Cursor.app/Contents/Resources/app/extensions/cursor-agent-worker/dist/main.js, bytes 280902–280911, SHA-256 521bcb5e201a81f3.
Not classified: non-prose-or-short.
Readable text: details
details
image pull failure
Source: desktop/Cursor.app/Contents/Resources/app/extensions/cursor-agent-worker/dist/main.js, bytes 280924–280944, SHA-256 77b499f9a4ec051e.
Not classified: non-prose-or-short.
Readable text: image_pull_failure
image_pull_failure
message · byte 280950
Source: desktop/Cursor.app/Contents/Resources/app/extensions/cursor-agent-worker/dist/main.js, bytes 280950–280959, SHA-256 fd3830a0864dd9df.
Not classified: non-prose-or-short.
Readable text: message
message
details · byte 280971
Source: desktop/Cursor.app/Contents/Resources/app/extensions/cursor-agent-worker/dist/main.js, bytes 280971–280980, SHA-256 521bcb5e201a81f3.
Not classified: non-prose-or-short.
Readable text: details
details
anyrun.v1.ContainerWaitFailure
Source: desktop/Cursor.app/Contents/Resources/app/extensions/cursor-agent-worker/dist/main.js, bytes 281006–281038, SHA-256 749f75d9db3057aa.
Not classified: non-prose-or-short.
Readable text: anyrun.v1.ContainerWaitFailure
anyrun.v1.ContainerWaitFailure
exit code · byte 281055
Source: desktop/Cursor.app/Contents/Resources/app/extensions/cursor-agent-worker/dist/main.js, bytes 281055–281066, SHA-256 f3a2ff6c1c655209.
Not classified: non-prose-or-short.
Readable text: exit_code
exit_code
scalar · byte 281072
Source: desktop/Cursor.app/Contents/Resources/app/extensions/cursor-agent-worker/dist/main.js, bytes 281072–281080, SHA-256 1cf2462dbf783967.
Not classified: non-prose-or-short.
Readable text: scalar
scalar
message · byte 281097
Source: desktop/Cursor.app/Contents/Resources/app/extensions/cursor-agent-worker/dist/main.js, bytes 281097–281106, SHA-256 fd3830a0864dd9df.
Not classified: non-prose-or-short.
Readable text: message
message
scalar · byte 281112
Source: desktop/Cursor.app/Contents/Resources/app/extensions/cursor-agent-worker/dist/main.js, bytes 281112–281120, SHA-256 1cf2462dbf783967.
Not classified: non-prose-or-short.
Readable text: scalar
scalar
anyrun.v1.InstallCommandFailure
Source: desktop/Cursor.app/Contents/Resources/app/extensions/cursor-agent-worker/dist/main.js, bytes 281150–281183, SHA-256 9e0981ac57e10cd0.
Not classified: non-prose-or-short.
Readable text: anyrun.v1.InstallCommandFailure
anyrun.v1.InstallCommandFailure
is system · byte 281200
Source: desktop/Cursor.app/Contents/Resources/app/extensions/cursor-agent-worker/dist/main.js, bytes 281200–281211, SHA-256 e32a1d19ed559999.
Not classified: non-prose-or-short.
Readable text: is_system
is_system
scalar · byte 281217
Source: desktop/Cursor.app/Contents/Resources/app/extensions/cursor-agent-worker/dist/main.js, bytes 281217–281225, SHA-256 1cf2462dbf783967.
Not classified: non-prose-or-short.
Readable text: scalar
scalar
anyrun.v1.DockerBuildFailure
Source: desktop/Cursor.app/Contents/Resources/app/extensions/cursor-agent-worker/dist/main.js, bytes 281255–281285, SHA-256 e5c1441c0a75d031.
Not classified: non-prose-or-short.
Readable text: anyrun.v1.DockerBuildFailure
anyrun.v1.DockerBuildFailure
exit code · byte 281302
Source: desktop/Cursor.app/Contents/Resources/app/extensions/cursor-agent-worker/dist/main.js, bytes 281302–281313, SHA-256 f3a2ff6c1c655209.
Not classified: non-prose-or-short.
Readable text: exit_code
exit_code
scalar · byte 281319
Source: desktop/Cursor.app/Contents/Resources/app/extensions/cursor-agent-worker/dist/main.js, bytes 281319–281327, SHA-256 1cf2462dbf783967.
Not classified: non-prose-or-short.
Readable text: scalar
scalar
anyrun.v1.ImagePullFailure
Source: desktop/Cursor.app/Contents/Resources/app/extensions/cursor-agent-worker/dist/main.js, bytes 281357–281385, SHA-256 7449da6b863c13c4.
Not classified: non-prose-or-short.
Readable text: anyrun.v1.ImagePullFailure
anyrun.v1.ImagePullFailure
category
Source: desktop/Cursor.app/Contents/Resources/app/extensions/cursor-agent-worker/dist/main.js, bytes 281402–281412, SHA-256 de46a45ced469701.
Not classified: non-prose-or-short.
Readable text: category
category
enum · byte 281418
Source: desktop/Cursor.app/Contents/Resources/app/extensions/cursor-agent-worker/dist/main.js, bytes 281418–281424, SHA-256 e49fb5f753e8aa4d.
Not classified: non-prose-or-short.
Readable text: enum
enum
retryable
Source: desktop/Cursor.app/Contents/Resources/app/extensions/cursor-agent-worker/dist/main.js, bytes 281458–281469, SHA-256 a7660d150121624d.
Not classified: non-prose-or-short.
Readable text: retryable
retryable
scalar · byte 281475
Source: desktop/Cursor.app/Contents/Resources/app/extensions/cursor-agent-worker/dist/main.js, bytes 281475–281483, SHA-256 1cf2462dbf783967.
Not classified: non-prose-or-short.
Readable text: scalar
scalar
http status
Source: desktop/Cursor.app/Contents/Resources/app/extensions/cursor-agent-worker/dist/main.js, bytes 281500–281513, SHA-256 9c616e16ce72dfb6.
Not classified: non-prose-or-short.
Readable text: http_status
http_status
scalar · byte 281519
Source: desktop/Cursor.app/Contents/Resources/app/extensions/cursor-agent-worker/dist/main.js, bytes 281519–281527, SHA-256 1cf2462dbf783967.
Not classified: non-prose-or-short.
Readable text: scalar
scalar
repository
Source: desktop/Cursor.app/Contents/Resources/app/extensions/cursor-agent-worker/dist/main.js, bytes 281551–281563, SHA-256 6827cb9deb196988.
Not classified: non-prose-or-short.
Readable text: repository
repository
scalar · byte 281569
Source: desktop/Cursor.app/Contents/Resources/app/extensions/cursor-agent-worker/dist/main.js, bytes 281569–281577, SHA-256 1cf2462dbf783967.
Not classified: non-prose-or-short.
Readable text: scalar
scalar
anyrun.v1.SnapshotState
Source: desktop/Cursor.app/Contents/Resources/app/extensions/cursor-agent-worker/dist/main.js, bytes 281607–281632, SHA-256 70aa56f3f8dbb131.
Not classified: non-prose-or-short.
Readable text: anyrun.v1.SnapshotState
anyrun.v1.SnapshotState
SNAPSHOT STATE UNSPECIFIED
Source: desktop/Cursor.app/Contents/Resources/app/extensions/cursor-agent-worker/dist/main.js, bytes 281645–281673, SHA-256 12d7eb4e2e247158.
Not classified: non-prose-or-short.
Readable text: SNAPSHOT_STATE_UNSPECIFIED
SNAPSHOT_STATE_UNSPECIFIED
UNSPECIFIED · byte 281684
Source: desktop/Cursor.app/Contents/Resources/app/extensions/cursor-agent-worker/dist/main.js, bytes 281684–281697, SHA-256 540a50091e105303.
Not classified: non-prose-or-short.
Readable text: UNSPECIFIED
UNSPECIFIED
SNAPSHOT STATE CREATING
Source: desktop/Cursor.app/Contents/Resources/app/extensions/cursor-agent-worker/dist/main.js, bytes 281710–281735, SHA-256 b124105d3e40e82f.
Not classified: non-prose-or-short.
Readable text: SNAPSHOT_STATE_CREATING
SNAPSHOT_STATE_CREATING
CREATING
Source: desktop/Cursor.app/Contents/Resources/app/extensions/cursor-agent-worker/dist/main.js, bytes 281746–281756, SHA-256 dc4844ebdfd8966c.
Not classified: non-prose-or-short.
Readable text: CREATING
CREATING
SNAPSHOT STATE READY
Source: desktop/Cursor.app/Contents/Resources/app/extensions/cursor-agent-worker/dist/main.js, bytes 281769–281791, SHA-256 c97ca5d16810af08.
Not classified: non-prose-or-short.
Readable text: SNAPSHOT_STATE_READY
SNAPSHOT_STATE_READY
READY
Source: desktop/Cursor.app/Contents/Resources/app/extensions/cursor-agent-worker/dist/main.js, bytes 281802–281809, SHA-256 f4fc3d96f56f82a6.
Not classified: non-prose-or-short.
Readable text: READY
READY
SNAPSHOT STATE FAILED
Source: desktop/Cursor.app/Contents/Resources/app/extensions/cursor-agent-worker/dist/main.js, bytes 281822–281845, SHA-256 9946d2c8df7252f6.
Not classified: non-prose-or-short.
Readable text: SNAPSHOT_STATE_FAILED
SNAPSHOT_STATE_FAILED